{"text_format":"1","workbook":"xlsx","n_sheets":15,"sheets":["DHCS Only","Instructions","1. Information","2. Component Summary","3. CSS","4. PEI","5. INN","6. WET","7. CFTN","8. WET RP, HP","9. Adjustment (MHSA)","10. Adjustment (FFP)","11. Comments","drop down fields","E-1 CountyState2017"],"not_rendered":{"charts":0,"images":0,"macros":1,"external_links":2,"defined_names":33,"comments":0,"pivot_tables":0},"unopened":[],"bounds":{"document_bytes":16777216,"sheet_cells":100000,"rows_first":2000,"rows_last":500,"rows_between":2000,"halvings":0,"cell_chars":16384,"cell_head_chars":4096},"cells_cut":0,"cells_raw":0,"read":"whole","date_system":"1900"}

{"sheet":"DHCS Only","index":0,"n_rows":3,"n_cols":1,"rows_kept":3,"cut":false,"hidden":true,"merged":[]}
["For DHCS use only."]
["Click button to lock or unlock all sheets for editing. "]
["This tab should be hidden when not in use. "]

{"sheet":"Instructions","index":1,"n_rows":18,"n_cols":3,"rows_kept":18,"cut":false,"hidden":false,"merged":[[13,1,15,1],[11,1,12,1],[11,2,12,2],[6,1,6,2],[7,1,7,2],[8,1,8,2],[9,1,9,2]]}
[]
[null,{"$f":"'1. Information'!B2","v":"Version 7/1/2018"}]
[null,{"$f":"'1. Information'!B3","v":"Annual Mental Health Services Act Revenue and Expenditure Report"}]
[null,{"$f":"'1. Information'!B4","v":"Fiscal Year 2017-18"}]
[null,"ARER Instructions "]
[]
[null,"• For detailed instructions, see Enclosure 2: Instruction Manual for Fiscal Year 2017-18 of the MHSA Annual Revenue and Expenditure Report. "]
[null,"• These worksheets are used to report the total expenditures for each MHSA-funded program. Expenditures should be recognized in the period that the fund liability is incurred. (Accounting Standards and Procedures for Counties, State Controller’s Office (SCO), February 2018). "]
[null,"• Counties must report any expenditure that occurred between July 1, 2017 and June 30, 2018, on the appropriate component worksheet."]
[null,"• Counties should reflect total (gross) program expenditures for each MHSA program on the MHSA Component Expenditure Worksheets."]
[]
[null,"Step 1: Complete the Information worksheet","The information provided on the Information worksheet automatically links to worksheets in the ARER.  This worksheet eliminates the redundant entry of county name, code, and date on worksheets. "]
[]
[null,"Step 2: Complete section one and two of the Component Summary worksheet","Section one: Enter the balance of Prudent Reserve and the Interest earned on the Local Mental Health Fund. Interest earned on local MHS fund is to be reported in total.  "]
[null,null,"Section two: Enter the component revenue received from prudent reserve transfers. Additionally, the worksheet is set up to distribute the interest reported in section one across CSS, PEI, and INN components according to 76%, 19% and 5%."]
[null,null,"Section three and four: These sections are linked to the remaining component worksheets and will auto populate as the county completes each individual worksheet."]
[null,"Step 3: Complete each component and adjustment worksheet","In general, counties will enter expenditure data in the blue boxes throughout the workbook. Cells shaded gray will require no data entry because it is an excel formula or data is not relevant for that particular cell."]
[null,"Step 4: Review the Component Summary worksheet","Counties should verify that each section of the Component Summary worksheet accurately reflect the expenditures reported on the component and adjustment worksheets."]

{"sheet":"1. Information","index":2,"n_rows":17,"n_cols":4,"rows_kept":17,"cut":false,"hidden":false,"merged":[]}
[]
[null,"Version 7/1/2018"]
[null,"Annual Mental Health Services Act Revenue and Expenditure Report"]
[null,"Fiscal Year 2017-18"]
[null,"Information"]
[]
[null,1,"Date:","2018-12-31"]
[null,2,"County:","Sierra"]
[null,3,"County Code:",{"$f":"IF(ISBLANK(D8),\"\",VLOOKUP(D8,Info_County_Code,2))","v":46}]
[null,4,"Address:","P.O. Box 265, 207 Front Street"]
[null,5,"City:","Loyalton"]
[null,6,"Zip:",96118]
[null,7,"County Population:  Over 200,000? (Yes or No)",{"$f":"IF(ISBLANK(D8),\"\",VLOOKUP(D8,County_Population,5,FALSE))","v":"No"}]
[null,8,"Name of Preparer:","Judy Blakney"]
[null,9,"Title of Preparer:","Fiscal Officer"]
[null,10,"Preparer Contact Email:","jblakney@sierracounty.ca.gov"]
[null,11,"Preparer Contact Telephone","(530) 993-6730"]

{"sheet":"2. Component Summary","index":3,"n_rows":41,"n_cols":14,"rows_kept":41,"cut":false,"hidden":false,"merged":[]}
[]
[null,{"$f":"'1. Information'!B2","v":"Version 7/1/2018"}]
[null,{"$f":"'1. Information'!B3","v":"Annual Mental Health Services Act Revenue and Expenditure Report"}]
[null,{"$f":"'1. Information'!B4","v":"Fiscal Year 2017-18"}]
[null,"Component Summary "]
[]
[null,"County:",{"$f":"IF(ISBLANK('1. Information'!D8),\"\",'1. Information'!D8)","v":"Sierra"},null,null,"Date:",{"$f":"IF(ISBLANK('1. Information'!D7),\"\",'1. Information'!D7)","v":"2018-12-31"}]
[]
[]
[]
[]
[]
[]
[null,"SECTION 1: Interest and Prudent Reserve",null,"TOTAL"]
[null,1,"Interest Earned on local MHS Fund",71779]
[null,2,"Local Prudent Reserve Beginning Balance",741451.88]
[null,3,"Local Prudent Reserve Ending Balance",{"$f":"D16+M22+M27+SUM('9. Adjustment (MHSA)'!F83:F112)","v":741451.88}]
[]
[null,null,null,"A","B","C","D","E","F","G","H","I","J","K"]
[null,null,null,"CSS","PEI","INN","WET","CFTN","TTACB","WET RP","PEI SW","MHSA HP","PR","TOTAL"]
{"$rows_left_out":22}
{"sheet":"3. CSS","index":4,"n_rows":132,"n_cols":12,"rows_kept":132,"cut":false,"hidden":false,"merged":[[23,2,23,4],[30,7,30,10],[30,3,30,5],[24,2,24,4],[11,6,11,9],[19,2,19,4],[20,2,20,4],[21,2,21,4],[22,2,22,4],[18,2,18,4],[16,2,16,4],[17,2,17,4],[0,1,0,3],[6,1,6,2],[13,2,13,4],[14,2,14,4],[15,2,15,4]]}
[]
[null,{"$f":"'1. Information'!B2","v":"Version 7/1/2018"}]
[null,{"$f":"'1. Information'!B3","v":"Annual Mental Health Services Act Revenue and Expenditure Report"}]
[null,{"$f":"'1. Information'!B4","v":"Fiscal Year 2017-18"}]
[null,"Community Services and Supports (CSS) Summary  "]
[]
[null,"County:",null,{"$f":"IF(ISBLANK('1. Information'!D8),\"\",'1. Information'!D8)","v":"Sierra"},null,"Date:",{"$f":"IF(ISBLANK('1. Information'!D7),\"\",'1. Information'!D7)","v":"2018-12-31"}]
[]
[null,"SECTION ONE"]
[]
[null,null,null,null,null,"A","B","C","D","E","F"]
[null,null,null,null,null,"MHSA Funds","Other Funds"]
[null,null,null,null,null,"Total MHSA (Including Interest)","Medi-Cal FFP","1991 Realignment","Behavioral Health Subaccount","Other","Grand Total"]
[null,1,"CSS Annual Planning Costs",null,null,5597,null,null,null,null,{"$f":"SUM(F14:J14)","v":5597}]
[null,2,"CSS Evaluation Costs",null,null,null,null,null,null,null,{"$f":"SUM(F15:J15)","v":0}]
[null,3,"CSS Administration Costs",null,null,184220,null,null,null,null,184220]
[null,4,"CSS Funds Transferred to JPA",null,null,null,null,null,null,null,0]
[null,5,"CSS Expenditure Incurred by JPA",null,null,null,null,null,null,null,0]
[null,6,"CSS Funds Transferred to CalHFA",null,null,null,null,null,null,null,0]
[null,7,"CSS Funds Transferred to WET",null,null,227631,null,null,null,null,227631]
{"$rows_left_out":113}
{"sheet":"4. PEI","index":5,"n_rows":135,"n_cols":19,"rows_kept":135,"cut":false,"hidden":false,"merged":[[33,3,33,10],[33,12,33,15],[28,2,28,4],[6,1,6,2],[12,2,12,4],[13,2,13,4],[14,2,14,4],[15,2,15,4],[16,2,16,4],[25,6,27,6],[11,6,11,9],[25,5,27,5],[20,2,20,4],[19,2,19,4],[17,2,17,4],[18,2,18,4]]}
[]
[null,{"$f":"'1. Information'!B2","v":"Version 7/1/2018"}]
[null,{"$f":"'1. Information'!B3","v":"Annual Mental Health Services Act Revenue and Expenditure Report"}]
[null,{"$f":"'1. Information'!B4","v":"Fiscal Year 2017-18"}]
[null,"Prevention and Early Intervention (PEI) Summary"]
[]
[null,"County:",null,{"$f":"IF(ISBLANK('1. Information'!D8),\"\",'1. Information'!D8)","v":"Sierra"},null,"Date:",{"$f":"IF(ISBLANK('1. Information'!D7),\"\",'1. Information'!D7)","v":"2018-12-31"}]
[]
[null,"SECTION ONE"]
[]
[null,null,null,null,null,"A","B","C","D","E","F"]
[null,null,null,null,null,"MHSA Funds","Other Funds"]
[null,null,null,null,null,"Total MHSA (Including Interest)","Medi-Cal FFP","1991 Realignment","Behavioral Health Subaccount","Other","Grand Total"]
[null,1,"PEI Annual Planning Costs",null,null,7713,null,null,null,null,{"$f":"SUM(F14:J14)","v":7713}]
[null,2,"PEI Evaluation Costs",null,null,null,null,null,null,null,{"$f":"SUM(F15:J15)","v":0}]
[null,3,"PEI Administration Costs",null,null,138612,null,null,null,null,138612]
[null,4,"PEI Funds Expended by CalMHSA for PEI SW ",null,null,null,null,null,null,null,0]
[null,5,"PEI Funds Transferred to JPA",null,null,null,null,null,null,null,0]
[null,6,"PEI Expenditure Incurred by JPA",null,null,null,null,null,null,null,0]
[null,7,"PEI Program Expenditures",null,null,{"$f":"SUMIF($G$36:$G$135,\"Combined Summary\",L$36:L$135) + SUMIF($F$36:$F$135,\"Standalone\",L$36:L$135)","v":151268},{"$f":"SUMIF($G$36:$G$135,\"Combined Summary\",M$36:M$135) + SUMIF($F$36:$F$135,\"Standalone\",M$36:M$135)","v":0},{"$f":"SUMIF($G$36:$G$135,\"Combined Summary\",N$36:N$135) + SUMIF($F$36:$F$135,\"Standalone\",N$36:N$135)","v":0},{"$f":"SUMIF($G$36:$G$135,\"Combined Summary\",O$36:O$135) + SUMIF($F$36:$F$135,\"Standalone\",O$36:O$135)","v":0},{"$f":"SUMIF($G$36:$G$135,\"Combined Summary\",P$36:P$135) + SUMIF($F$36:$F$135,\"Standalone\",P$36:P$135)","v":8450},159718]
{"$rows_left_out":116}
{"sheet":"5. INN","index":6,"n_rows":132,"n_cols":16,"rows_kept":132,"cut":false,"hidden":false,"merged":[[21,2,21,4],[11,6,11,9],[26,3,26,9],[26,11,26,14],[0,1,0,3],[14,2,14,4],[18,2,18,4],[19,2,19,4],[20,2,20,4],[17,2,17,4],[6,1,6,2],[13,2,13,4],[12,2,12,4],[15,2,15,4],[16,2,16,4]]}
[]
[null,{"$f":"'1. Information'!B2","v":"Version 7/1/2018"}]
[null,{"$f":"'1. Information'!B3","v":"Annual Mental Health Services Act Revenue and Expenditure Report"}]
[null,{"$f":"'1. Information'!B4","v":"Fiscal Year 2017-18"}]
[null,"Innovation (INN) Summary"]
[]
[null,"County:",null,{"$f":"IF(ISBLANK('1. Information'!D8),\"\",'1. Information'!D8)","v":"Sierra"},null,"Date:",{"$f":"IF(ISBLANK('1. Information'!D7),\"\",'1. Information'!D7)","v":"2018-12-31"}]
[]
[null,"SECTION ONE"]
[]
[null,null,null,null,null,"A","B","C","D","E","F"]
[null,null,null,null,null,"MHSA Funds","Other Funds"]
[null,null,null,null,null,"Total MHSA (Including Interest)","Medi-Cal FFP","1991 Realignment","Behavioral Health Subaccount","Other","Grand Total"]
[null,1,"INN Annual Planning Costs",null,null,null,null,null,null,null,{"$f":"SUM(F14:J14)","v":0}]
[null,2,"INN Indirect Administration",null,null,null,null,null,null,null,{"$f":"SUM(F15:J15)","v":0}]
[null,3,"INN Funds Transferred to JPA",null,null,null,null,null,null,null,{"$f":"SUM(F16:J16)","v":0}]
[null,4,"INN Expenditure Incurred by JPA",null,null,null,null,null,null,null,{"$f":"SUM(F17:J17)","v":0}]
[null,5,"INN Project Administration",null,null,{"$f":"SUMIF($J$29:$J$132,\"Project Administration\",K$29:K$132)","v":0},{"$f":"SUMIF($J$29:$J$132,\"Project Administration\",L$29:L$132)","v":0},{"$f":"SUMIF($J$29:$J$132,\"Project Administration\",M$29:M$132)","v":0},{"$f":"SUMIF($J$29:$J$132,\"Project Administration\",N$29:N$132)","v":0},{"$f":"SUMIF($J$29:$J$132,\"Project Administration\",O$29:O$132)","v":0},{"$f":"SUM(F18:J18)","v":0}]
[null,6,"INN Project Evaluation",null,null,{"$f":"SUMIF($J$29:$J$132,\"Project Evaluation\",K$29:K$132)","v":0},{"$f":"SUMIF($J$29:$J$132,\"Project Evaluation\",L$29:L$132)","v":0},{"$f":"SUMIF($J$29:$J$132,\"Project Evaluation\",M$29:M$132)","v":0},{"$f":"SUMIF($J$29:$J$132,\"Project Evaluation\",N$29:N$132)","v":0},{"$f":"SUMIF($J$29:$J$132,\"Project Evaluation\",O$29:O$132)","v":0},0]
[null,7,"INN Project Direct",null,null,{"$f":"SUMIF($J$29:$J$132,\"Project Direct\",K$29:K$132)","v":0},{"$f":"SUMIF($J$29:$J$132,\"Project Direct\",L$29:L$132)","v":0},{"$f":"SUMIF($J$29:$J$132,\"Project Direct\",M$29:M$132)","v":0},{"$f":"SUMIF($J$29:$J$132,\"Project Direct\",N$29:N$132)","v":0},{"$f":"SUMIF($J$29:$J$132,\"Project Direct\",O$29:O$132)","v":0},0]
{"$rows_left_out":113}
{"sheet":"6. WET","index":7,"n_rows":32,"n_cols":11,"rows_kept":32,"cut":false,"hidden":false,"merged":[[11,6,11,9],[25,5,25,8],[13,2,13,4],[16,2,16,4],[17,2,17,4],[14,2,14,4],[15,2,15,4],[19,2,19,4],[18,2,18,4]]}
[]
[null,{"$f":"'1. Information'!B2","v":"Version 7/1/2018"}]
[null,{"$f":"'1. Information'!B3","v":"Annual Mental Health Services Act Revenue and Expenditure Report"}]
[null,{"$f":"'1. Information'!B4","v":"Fiscal Year 2017-18"}]
[null,"Workforce Education and Training (WET) Summary"]
[]
[null,null,"County:",{"$f":"IF(ISBLANK('1. Information'!D8),\"\",'1. Information'!D8)","v":"Sierra"},null,"Date:",{"$f":"IF(ISBLANK('1. Information'!D7),\"\",'1. Information'!D7)","v":"2018-12-31"}]
[]
[null,"SECTION ONE"]
[]
[null,null,null,null,null,"A","B","C","D","E","F"]
[null,null,null,null,null,"MHSA Fund","Other Fund"]
[null,null,null,null,null,"Total MHSA (Including Interest)","Medi-Cal FFP","1991 Realignment","Behavioral Health Subaccount","Other","Grand Total"]
[null,1,"WET Annual Planning Costs",null,null,null,null,null,null,null,{"$f":"SUM(F14:J14)","v":0}]
[null,2,"WET Evaluation Costs",null,null,null,null,null,null,null,{"$f":"SUM(F15:J15)","v":0}]
[null,3,"WET Administration Costs",null,null,15547,null,null,null,null,15547]
[null,4,"WET Funds Transferred to JPA",null,null,null,null,null,null,null,0]
[null,5,"WET Expenditure Incurred by JPA",null,null,null,null,null,null,null,0]
[null,6,"WET Program Expenditures",null,null,{"$f":"SUM(E28:E32)","v":25639},{"$f":"SUM(F28:F32)","v":0},0,0,{"$f":"SUM(I28:I32)","v":0},25639]
[null,7,"Total WET Expenditures (Excluding Transfers to JPA)",null,null,{"$f":"SUM(F14:F16,F18:F19)","v":41186},{"$f":"SUM(G14:G16,G18:G19)","v":0},0,0,0,{"$f":"SUM(K14:K16,K18:K19)","v":41186}]
{"$rows_left_out":13}
{"sheet":"7. CFTN","index":8,"n_rows":47,"n_cols":12,"rows_kept":47,"cut":false,"hidden":false,"merged":[[25,7,25,10],[11,6,11,9],[0,1,0,3],[13,2,13,4],[15,2,15,4],[16,2,16,4],[17,2,17,4],[20,2,20,4],[19,2,19,4],[14,2,14,4],[18,2,18,4],[25,3,25,5]]}
[]
[null,{"$f":"'1. Information'!B2","v":"Version 7/1/2018"}]
[null,{"$f":"'1. Information'!B3","v":"Annual Mental Health Services Act Revenue and Expenditure Report"}]
[null,{"$f":"'1. Information'!B4","v":"Fiscal Year 2017-18"}]
[null,"Capital Facility Technological Needs (CFTN) Summary"]
[]
[null,"County:",null,{"$f":"IF(ISBLANK('1. Information'!D8),\"\",'1. Information'!D8)","v":"Sierra"},null,"Date:",{"$f":"IF(ISBLANK('1. Information'!D7),\"\",'1. Information'!D7)","v":"2018-12-31"}]
[]
[null,"SECTION ONE"]
[]
[null,null,null,null,null,"A","B","C","D","E","F"]
[null,null,null,null,null,"MHSA Funds","Other Fund"]
[null,null,null,null,null,"Total MHSA (Including Interest)","Medi-Cal FFP","1991 Realignment","Behavioral Health Subaccount","Other","Grand Total"]
[null,1,"CF Annual Planning Costs",null,null,null,null,null,null,null,{"$f":"SUM(F14:J14)","v":0}]
[null,2,"TN Annual Planning Costs",null,null,null,null,null,null,null,{"$f":"SUM(F15:J15)","v":0}]
[null,3,"CF Evaluation Costs",null,null,null,null,null,null,null,0]
[null,4,"TN Evaluation Costs",null,null,null,null,null,null,null,0]
[null,5,"CF Administration",null,null,null,null,null,null,null,0]
[null,6,"TN Administration",null,null,null,null,null,null,null,0]
[null,7,"CFTN Program Expenditure",null,null,{"$f":"SUM(G28:G47)","v":12519},{"$f":"SUM(H28:H47)","v":0},{"$f":"SUM(I28:I47)","v":0},{"$f":"SUM(J28:J47)","v":0},{"$f":"SUM(K28:K47)","v":0},12519]
{"$rows_left_out":28}
{"sheet":"8. WET RP, HP","index":9,"n_rows":15,"n_cols":10,"rows_kept":15,"cut":false,"hidden":false,"merged":[[0,1,0,3],[6,1,6,2],[11,5,11,8]]}
[]
[null,{"$f":"'1. Information'!B2","v":"Version 7/1/2018"}]
[null,{"$f":"'1. Information'!B3","v":"Annual Mental Health Services Act Revenue and Expenditure Report"}]
[null,{"$f":"'1. Information'!B4","v":"Fiscal Year 2017-18"}]
[null,"WET RP and MHSA HP Summary"]
[]
[null,"County:",null,{"$f":"IF(ISBLANK('1. Information'!D8),\"\",'1. Information'!D8)","v":"Sierra"},null,"Date:",{"$f":"IF(ISBLANK('1. Information'!D7),\"\",'1. Information'!D7)","v":"2018-12-31"}]
[]
[null,"SECTION ONE"]
[]
[null,null,"A","B","C","D","E","F","G","H"]
[null,null,null," WET RP, HP Component","MHSA Funds","Other Funds"]
[null,"#","County Code","Funding Type","Total MHSA (Including Interest)","Medi-Cal FFP","1991 Realignment","Behavioral Health Subaccount","Other","Grand Total"]
[null,1,{"$f":"IF(J14<>0,VLOOKUP($D$7,Info_County_Code,2,FALSE),\"\")","v":""},"WET Regional Partnerships (WET RP)",null,null,null,null,null,{"$f":"SUM(E14:I14)","v":0}]
[null,2,{"$f":"IF(J15<>0,VLOOKUP($D$7,Info_County_Code,2,FALSE),\"\")","v":""},"MHSA Housing Program (Unencumbered Funds)",null,null,null,null,null,{"$f":"SUM(E15:I15)","v":0}]

{"sheet":"9. Adjustment (MHSA)","index":10,"n_rows":112,"n_cols":7,"rows_kept":112,"cut":false,"hidden":false,"merged":[[6,1,6,2]]}
[]
[null,{"$f":"'1. Information'!B2","v":"Version 7/1/2018"}]
[null,{"$f":"'1. Information'!B3","v":"Annual Mental Health Services Act Revenue and Expenditure Report"}]
[null,{"$f":"'1. Information'!B4","v":"Fiscal Year 2017-18"}]
[null,"Adjustments Worksheet (MHSA)"]
[]
[null,"County:",null,{"$f":"IF(ISBLANK('1. Information'!D8),\"\",'1. Information'!D8)","v":"Sierra"},null,"Date",{"$f":"IF(ISBLANK('1. Information'!D7),\"\",'1. Information'!D7)","v":"2018-12-31"}]
[]
[null,"SECTION ONE"]
[]
[null,null,"A","B","C","D","E"]
[null,"#","County","Component","Adjustment to FY","Amount","Reason"]
[null,1,{"$f":"IF(F13<>0,VLOOKUP($D$7,Info_County_Code,2,FALSE),\"\")","v":""}]
[null,2,""]
[null,3,""]
[null,4,""]
[null,5,""]
[null,6,""]
[null,7,""]
[null,8,""]
{"$rows_left_out":93}
{"sheet":"10. Adjustment (FFP)","index":11,"n_rows":52,"n_cols":9,"rows_kept":52,"cut":false,"hidden":false,"merged":[[6,1,6,2],[0,1,0,3]]}
[]
[null,{"$f":"'1. Information'!B2","v":"Version 7/1/2018"}]
[null,{"$f":"'1. Information'!B3","v":"Annual Mental Health Services Act Revenue and Expenditure Report"}]
[null,{"$f":"'1. Information'!B4","v":"Fiscal Year 2017-18"}]
[null,"FFP Revenue Adjustment"]
[]
[null,"County:",null,{"$f":"IF(ISBLANK('1. Information'!D8),\"\",'1. Information'!D8)","v":"Sierra"},null,"Date:",{"$f":"IF(ISBLANK('1. Information'!D7),\"\",'1. Information'!D7)","v":"2018-12-31"}]
[]
[null,"SECTION ONE"]
[]
[null,null,"A","B","C","D","E","F","G"]
[null,"#","County","Fiscal Year","Cost Report Stage","Component","Beginning Balance","Adjustment Amount","Ending Balance"]
[null,1,{"$f":"IF(I13<>0,VLOOKUP($D$7,Info_County_Code,2,FALSE),\"\")","v":""},null,null,null,null,null,{"$f":"SUM(G13:H13)","v":0}]
[null,2,"",null,null,null,null,null,{"$f":"SUM(G14:H14)","v":0}]
[null,3,"",null,null,null,null,null,0]
[null,4,"",null,null,null,null,null,0]
[null,5,"",null,null,null,null,null,0]
[null,6,"",null,null,null,null,null,0]
[null,7,"",null,null,null,null,null,0]
[null,8,"",null,null,null,null,null,0]
{"$rows_left_out":33}
{"sheet":"11. Comments","index":12,"n_rows":47,"n_cols":3,"rows_kept":47,"cut":false,"hidden":false,"merged":[]}
[]
[null,{"$f":"'1. Information'!B2","v":"Version 7/1/2018"}]
[null,{"$f":"'1. Information'!B3","v":"Annual Mental Health Services Act Revenue and Expenditure Report"}]
[null,{"$f":"'1. Information'!B4","v":"Fiscal Year 2017-18"}]
[null,"Comments"]
[]
[null,null,"Comments"]
[null,1,"Evaluation Costs for all programs are embedded in Administration.  "]
[null,2]
[null,3]
[null,4]
[null,5]
[null,6]
[null,7]
[null,8]
[null,9]
[null,10]
[null,11]
[null,12]
[null,13]
{"$rows_left_out":28}
{"sheet":"drop down fields","index":13,"n_rows":60,"n_cols":14,"rows_kept":60,"cut":false,"hidden":true,"merged":[[0,0,0,1]]}
["Info_County_Code",null,"Info_Population","CSS_Service_Category","PEI_Combined_Standalone","PEI_Program_Type","INN_Expenditure_Type","WET_Funding_Category","CFTN_Project_Type","Adjustment_MHSA_Component","MHSA_Adjustment_FY","FFP_Adjustment_FY","Adjustment_Reason","Cost_Report_Stage"]
["Alameda",1,"Yes","FSP","Combined","Prevention","Project","Workforce Staffing","Capital Facility","CSS","FY 2015-16","FY 2009-10","Cost Report Reconciliation","Audited"]
["Alpine",2,"No","Non-FSP","Standalone","Early Intervention","Project Administration","Training/Technical Assistance","Technological Need","PEI","FY 2016-17","FY 2010-11","Cost Report Audit","Settled"]
["Amador",3,null,null,null,"Outreach","Project Evaluation","MH Career Pathways",null,"INN",null,"FY 2011-12","SDMC Chart Audit","Initial"]
["Berkeley City",65,null,null,null,"Stigma & Discrimination Reduction",null,"Residency/Internship",null,"WET",null,"FY 2012-13","Local Quality Assurance Audit"]
["Butte",4,null,null,null,"Suicide Prevention",null,"Financial Incentive",null,"CFTN",null,"FY 2013-14","Error"]
["Calaveras",5,null,null,null,"Access and Linkage",null,null,null,"WET RP",null,"FY 2014-15","Other"]
["Colusa",6,null,null,null,"Improving Timely Access",null,null,null,"PEI SW",null,"FY 2015-16"]
["Contra Costa",7,null,null,null,"Combined Summary",null,null,null,"MHSA HP",null,"FY 2016-17"]
["Del Norte",8,null,null,null,null,null,null,null,"Prudent Reserve"]
["El Dorado",9]
["Fresno",10]
["Glenn",11]
["Humboldt",12]
["Imperial",13]
["Inyo",14]
["Kern",15]
["Kings",16]
["Lake",17]
["Lassen",18]
{"$rows_left_out":41}
{"sheet":"E-1 CountyState2017","index":14,"n_rows":83,"n_cols":5,"rows_kept":83,"cut":false,"hidden":true,"merged":[[4,1,4,2],[1,0,1,4],[2,0,2,4]]}
[null,null,null,"About the Data"]
["E-1: State/County Population Estimates with Annual Percent Change"]
["January 1, 2017 and 2018"]
[]
["State/County","           Total Population",null,"Percent"]
[null,"2017-01-01","2018-01-01","Change","County Population:  Over 200,000? (Yes or No)"]
[]
["California",39500973,39809693,0.8]
[]
["Alameda",1646405,1660202,0.8,{"$f":"IF(B10>=200000,\"Yes\", \"No\")","v":"Yes"}]
["Alpine",1156,1154,-0.2,{"$f":"IF(B11>=200000,\"Yes\", \"No\")","v":"No"}]
["Amador",38382,38094,-0.8,"No"]
["Butte",226403,227621,0.5,"Yes"]
["Calaveras",45175,45157,0,"No"]
["Colusa",22050,22098,0.2,"No"]
["Contra Costa",1139313,1149363,0.9,"Yes"]
["Del Norte",27060,27221,0.6,"No"]
["El Dorado",186223,188399,1.2,"No"]
["Fresno",995233,1007229,1.2,"Yes"]
["Glenn",28730,28796,0.2,"No"]
{"$rows_left_out":63}