{"text_format":"1","workbook":"xlsx","n_sheets":15,"sheets":["DHCS Only","Instructions","1. Information","2. Component Summary","3. CSS","4. PEI","5. INN","6. WET","7. CFTN","8. TTACB, WET RP, HP","9. Adjustment (MHSA)","10. Adjustment (FFP)","11. Comments","drop down fields","E-1 CountyState2017"],"not_rendered":{"charts":0,"images":0,"macros":1,"external_links":0,"defined_names":28,"comments":0,"pivot_tables":0},"unopened":[],"bounds":{"document_bytes":16777216,"sheet_cells":100000,"rows_first":2000,"rows_last":500,"rows_between":2000,"halvings":0,"cell_chars":16384,"cell_head_chars":4096},"cells_cut":0,"cells_raw":0,"read":"whole","date_system":"1900"}

{"sheet":"DHCS Only","index":0,"n_rows":3,"n_cols":1,"rows_kept":3,"cut":false,"hidden":true,"merged":[]}
["For DHCS use only."]
["Click button to lock or unlock all sheets for editing. "]
["This tab should be hidden when not in use. "]

{"sheet":"Instructions","index":1,"n_rows":16,"n_cols":3,"rows_kept":16,"cut":false,"hidden":false,"merged":[[11,1,13,1],[9,1,10,1],[9,2,10,2],[4,1,4,2],[5,1,5,2],[6,1,6,2],[7,1,7,2]]}
[null,"Annual Mental Health Services Act Revenue and Expenditure Report"]
[null,"Fiscal Year 2016-17"]
[null,"ARER Instructions (v. 01/25/2018)"]
[]
[null,"• For detailed instructions, see Enclosure 2: Instruction Manual for Fiscal Year 2016-17 of the MHSA Annual Revenue and Expenditure Report. "]
[null,"• These worksheets are used to report the total expenditures for each MHSA-funded program. Expenditures should be recognized in the period that the fund liability is incurred. (Accounting Standards and Procedures for Counties, State Controller’s Office (SCO), May 2014). "]
[null,"• Counties must report any expenditure that occurred between July 1, 2016 and June 30, 2017, on the appropriate component worksheet."]
[null,"• Counties should reflect total (gross) program expenditures for each MHSA program on the MHSA Component Expenditure Worksheets."]
[]
[null,"Step 1: Complete the Information worksheet","The information provided on the Information worksheet automatically links to worksheets in the ARER.  This worksheet eliminates the redundant entry of county name, code, and date on worksheets. "]
[]
[null,"Step 2: Complete section one and two of the Component Summary worksheet","Section one provides the total amount of unspent funds available from prior fiscal years.  These amounts should match the amount of unspent funds previously reported in the FY 2015-16 ARER, Unspent MHSA Funds in the Local Mental Health Service (MHS) Fund (Section 6)."]
[null,null,"Section two provides the total amount of revenue received and deposited into the local MHS Fund from July 1, 2016 through June 30, 2017."]
[null,null,"Skip section three through seven of the Component Summary worksheet. These sections are linked to the remaining component worksheets and will auto populate as the county completes each individual worksheet."]
[null,"Step 3: Complete each component and adjustment worksheet","In general, counties will enter expenditure data in the blue boxes throughout the workbook. Cells shaded gray will require no data entry because it is an excel formula or data is not relevant for that particular cell."]
[null,"Step 4: Review the Component Summary worksheet","Counties should verify that sections three through seven of the Component Summary worksheet accurately reflect the expenditures reported on the component and adjustment worksheets."]

{"sheet":"1. Information","index":2,"n_rows":15,"n_cols":4,"rows_kept":15,"cut":false,"hidden":false,"merged":[]}
[null,"Annual Mental Health Services Act Revenue and Expenditure Report"]
[null,"Fiscal Year 2016-17"]
[null,"Information"]
[]
[null,1,"Date:","2018-06-27"]
[null,2,"County:","Sierra"]
[null,3,"County Code:",{"$f":"IF(ISBLANK(D6),\"\",VLOOKUP(D6,Info_County_Code,2))","v":46}]
[null,4,"Address:","207 Front Street"]
[null,5,"City:","Loyalton"]
[null,6,"Zip:",96118]
[null,7,"County Population:  Over 200,000? (Yes or No)",{"$f":"IF(ISBLANK(D6),\"\",VLOOKUP(D6,County_Population,5,FALSE))","v":"No"}]
[null,8,"Name of Preparer:","Judy Blakney"]
[null,9,"Title of Preparer:","Fiscal Officer"]
[null,10,"Preparer Contact Email:","jblakney@sierracounty.ca.gov"]
[null,11,"Preparer Contact Telephone","(530) 993-6720"]

{"sheet":"2. Component Summary","index":3,"n_rows":103,"n_cols":14,"rows_kept":103,"cut":false,"hidden":false,"merged":[[4,1,4,2],[61,1,61,2],[76,1,76,2],[55,1,55,2]]}
[null,"Annual Mental Health Services Act Revenue and Expenditure Report"]
[null,"Fiscal Year 2016-17"]
[null,"Component Summary "]
[]
[null,"County:",null,{"$f":"IF(ISBLANK('1. Information'!D6),\"\",'1. Information'!D6)","v":"Sierra"},null,"Date:",{"$f":"IF(ISBLANK('1. Information'!D5),\"\",'1. Information'!D5)","v":"2018-06-27"}]
[]
[null,null,null,null,"A"]
[null,null,null,null,"% of revenue "]
[null,1,"Total Annual Planning Costs",{"$f":"'3. CSS'!F14+'4. PEI'!F14+'5. INN'!F14+'6. WET'!F14+'7. CFTN'!F14","v":3978},{"$f":"IF(AND(N33>0,D9>0),D9/N33,\"\")","v":2.5848809804613409E-3},"Total MHSA costs for planning for all components may not exceed 5 percent of the total annual MHSA revenues received by the County"]
[null,2,"Total Evaluation Costs",{"$f":"'3. CSS'!F15+'4. PEI'!F15+'5. INN'!F17+'6. WET'!F15+'7. CFTN'!F16+'7. CFTN'!F17","v":0}]
[null,3,"Total Administration",{"$f":"'3. CSS'!F16+'4. PEI'!F16+'5. INN'!F15+'5. INN'!F16+'6. WET'!F16+'7. CFTN'!F18+'7. CFTN'!F19","v":196903}]
[]
[null,null,null,"A","B","C","D","E","F","G","H","I","J","K"]
[null,null,null,"CSS","PEI","INN","WET","CFTN","TTACB","WET RP","PEI SW","MHSA HP","PR","TOTAL"]
[null,"SECTION 1: Unspent MHSA Funds Available in the MHS Fund From Prior Fiscal Years"]
[null,1,"Local Prudent Reserve",null,null,null,null,null,null,null,null,null,793611,{"$f":"M16","v":793611}]
[null,2,"FY 2006-07",null,null,null,null,null,null,null,null,null,null,{"$f":"SUM(D17:L17)","v":0}]
[null,3,"FY 2007-08",null,null,null,null,359152,null,null,null,null,null,{"$f":"SUM(D18:L18)","v":359152}]
[null,4,"FY 2008-09",null,null,63500,null,180910,400,null,null,null,null,244810]
[null,5,"FY 2009-10",null,213500,63500,null,null,400,null,null,null,null,277400]
{"$rows_left_out":84}
{"sheet":"3. CSS","index":4,"n_rows":83,"n_cols":22,"rows_kept":83,"cut":false,"hidden":false,"merged":[[14,2,14,4],[15,2,15,4],[18,2,18,4],[24,2,24,4],[11,6,11,9],[16,2,16,4],[17,2,17,4],[0,1,0,3],[6,1,6,2],[13,2,13,4],[2,1,2,10],[3,1,3,10],[4,1,4,10],[11,10,11,20],[36,7,36,10],[36,11,36,21],[36,2,36,6],[19,2,19,4],[21,2,21,4],[20,2,20,4],[29,2,29,4],[30,2,30,4],[31,2,31,4],[22,2,22,4],[23,2,23,4]]}
[null,"Back to Summary"]
[]
[null,"Annual Mental Health Services Act Revenue and Expenditure Report          "]
[null,"Fiscal Year 2016-17"]
[null,"Community Services and Supports (CSS) Summary  "]
[]
[null,"County:",null,{"$f":"IF(ISBLANK('1. Information'!D6),\"\",'1. Information'!D6)","v":"Sierra"},null,"Date:",{"$f":"IF(ISBLANK('1. Information'!D5),\"\",'1. Information'!D5)","v":"2018-06-27"}]
[]
[null,"SECTION ONE"]
[]
[null,null,null,null,null,"A","B","C","D","E","F","G","H","I","J","K","L","M","N","O","P"]
[null,null,null,null,null,null,"Other Funds",null,null,null,"MHSA Funds"]
[null,null,null,null,null,"Total","Medi-Cal FFP","1991 Realignment","Behavioral Health Subaccount","Other Funding","Total MHSA CSS (Including MHSA Interest)","MHSA Interest","MHSA CSS 2016-17","MHSA CSS 2015-16","MHSA CSS 2014-15","MHSA CSS 2013-14","MHSA CSS 2012-13","MHSA CSS 2011-12","MHSA CSS 2010-11","MHSA CSS 2009-10","MHSA CSS 2008-09"]
[null,1,"CSS Annual Planning Costs",null,null,{"$f":"SUM($G14:$J14,$K14)","v":3978},null,null,null,null,{"$f":"SUM($M14:$U14, $L14)","v":3978},null,null,null,3978]
[null,2,"CSS Evaluation Costs",null,null,{"$f":"SUM($G15:$J15,$K15)","v":0},null,null,null,null,{"$f":"SUM($M15:$U15, $L15)","v":0},null,null,null,0]
[null,3,"CSS Administration Costs",null,null,160061,null,null,null,null,160061,10083,null,null,149978]
[null,4,"CSS Funds Transferred to JPA",null,null,{"$f":"SUM($G17:$J17,$K17)","v":0},null,null,null,null,0]
[null,5,"CSS Expenditure Incurred by JPA",null,null,{"$f":"SUM($G18:$J18,$K18)","v":0},null,null,null,null,{"$f":"SUM($M18:$U18, $L18)","v":0}]
[null,6,"CSS Funds Transferred to CalHFA",null,null,{"$f":"SUM($G19:$J19,$K19)","v":0},null,null,null,null,{"$f":"SUM($M19:$U19, $L19)","v":0}]
[null,7,"CSS Funds Transferred to WET",null,null,{"$f":"SUM($G20:$J20,$K20)","v":0},null,null,null,null,{"$f":"SUM($M20:$U20, $L20)","v":0}]
{"$rows_left_out":64}
{"sheet":"4. PEI","index":5,"n_rows":66,"n_cols":27,"rows_kept":66,"cut":false,"hidden":false,"merged":[[26,6,28,6],[34,2,34,11],[26,5,28,5],[11,6,11,9],[11,10,11,20],[29,2,29,4],[6,1,6,2],[34,12,34,15],[34,16,34,26],[12,2,12,4],[13,2,13,4],[14,2,14,4],[15,2,15,4],[20,2,20,4],[21,2,21,4],[19,2,19,4],[17,2,17,4],[18,2,18,4],[16,2,16,4]]}
[null,"Back to Summary"]
[]
[null,"Annual Mental Health Services Act Revenue and Expenditure Report       "]
[null,"Fiscal Year 2016-17"]
[null,"Prevention and Early Intervention (PEI) Summary"]
[]
[null,"County:",null,{"$f":"IF(ISBLANK('1. Information'!D6),\"\",'1. Information'!D6)","v":"Sierra"},null,"Date:",{"$f":"IF(ISBLANK('1. Information'!D5),\"\",'1. Information'!D5)","v":"2018-06-27"}]
[]
[null,"SECTION ONE"]
[]
[null,null,null,null,null,"A","B","C","D","E","F","G","H","I","J","K","L","M","N","O","P"]
[null,null,null,null,null,null,"Other Funds",null,null,null,"MHSA Funds"]
[null,null,null,null,null,"Total","Medi-Cal FFP","1991 Realignment","Behavioral Health Subaccount","Other Funding","Total MHSA PEI (Including MHSA Interest)","MHSA Interest","MHSA PEI 2016-17","MHSA PEI 2015-16","MHSA PEI 2014-15","MHSA PEI 2013-14","MHSA PEI 2012-13","MHSA PEI 2011-12","MHSA PEI 2010-11","MHSA PEI 2009-10","MHSA PEI 2008-09"]
[null,1,"PEI Annual Planning Costs",null,null,{"$f":"SUM(G14:J14,K14)","v":0},null,null,null,null,{"$f":"SUM(L14,M14:U14)","v":0}]
[null,2,"PEI Evaluation Costs",null,null,{"$f":"SUM(G15:J15,K15)","v":0},null,null,null,null,{"$f":"SUM(L15,M15:U15)","v":0}]
[null,3,"PEI Administration Costs",null,null,{"$f":"SUM(G16:J16,K16)","v":30112},null,null,null,null,30112,7448,null,null,22664]
[null,4,"PEI Funds Expended by CalMHSA for PEI SW ",null,null,{"$f":"SUM(G17:J17,K17)","v":0},null,null,null,null,0]
[null,5,"PEI Funds Transferred to JPA",null,null,{"$f":"SUM(G18:J18,K18)","v":0},null,null,null,null,0]
[null,6,"PEI Expenditure Incurred by JPA",null,null,{"$f":"SUM(G19:J19,K19)","v":0},null,null,null,null,0]
[null,7,"PEI Program Expenditures",null,null,{"$f":"SUM(G20:J20,K20)","v":167290},{"$f":"SUMIF($G$37:$G$66,\"Combined Summary\",M$37:M$66) + SUMIF($F$37:$F$66,\"Standalone\",M$37:M$66)","v":0},0,0,0,167290,0,0,0,167290,0,0,0,0,0,0]
{"$rows_left_out":47}
{"sheet":"5. INN","index":6,"n_rows":87,"n_cols":26,"rows_kept":87,"cut":false,"hidden":false,"merged":[[19,2,19,4],[20,2,20,4],[25,15,25,25],[25,2,25,9],[11,10,11,20],[11,6,11,9],[25,11,25,14],[0,1,0,3],[14,2,14,4],[16,2,16,4],[17,2,17,4],[18,2,18,4],[15,2,15,4],[6,1,6,2],[13,2,13,4],[12,2,12,4]]}
[null,"Back to Summary"]
[]
[null,"Annual Mental Health Services Act Revenue and Expenditure Report for"]
[null,"Fiscal Year 2016-17"]
[null,"Innovation (INN) Summary"]
[]
[null,"County:",null,{"$f":"IF(ISBLANK('1. Information'!D6),\"\",'1. Information'!D6)","v":"Sierra"},null,"Date:",{"$f":"IF(ISBLANK('1. Information'!D5),\"\",'1. Information'!D5)","v":"2018-06-27"}]
[]
[null,"SECTION ONE"]
[]
[null,null,null,null,null,"A","B","C","D","E","F","G","H","I","J","K","L","M","N","O","P"]
[null,null,null,null,null,null,"Other Funds",null,null,null,"MHSA INN Fiscal Year"]
[null,null,null,null,null,"Total","Medi-Cal FFP","1991 Realignment","Behavioral Health Subaccount","Other Funding","Total MHSA INN (Including MHSA Interest)","MHSA Interest","MHSA INN 2016-17","MHSA INN 2015-16","MHSA INN 2014-15","MHSA INN 2013-14","MHSA INN 2012-13","MHSA INN 2011-12","MHSA INN 2010-11","MHSA INN 2009-10","MHSA INN 2008-09"]
[null,1,"INN Annual Planning Costs",null,null,{"$f":"SUM(G14:J14,K14)","v":0},null,null,null,null,{"$f":"SUM(L14,M14:U14)","v":0}]
[null,2,"INN Indirect Administration",null,null,{"$f":"SUM(G15:J15,K15)","v":0},null,null,null,null,{"$f":"SUM(L15,M15:U15)","v":0}]
[null,3,"INN Project Administration",null,null,0,{"$f":"SUMIF($J$28:$J$87,\"Project Administration\",L$28:L$87)","v":0},{"$f":"SUMIF($J$28:$J$87,\"Project Administration\",M$28:M$87)","v":0},{"$f":"SUMIF($J$28:$J$87,\"Project Administration\",N$28:N$87)","v":0},{"$f":"SUMIF($J$28:$J$87,\"Project Administration\",O$28:O$87)","v":0},0,{"$f":"SUMIF($J$28:$J$87,\"Project Administration\",Q$28:Q$87)","v":0},0,0,0,0,0,0,0,0,0]
[null,4,"INN Project Evaluation",null,null,0,{"$f":"SUMIF($J$28:$J$87,\"Project Evaluation\",L$28:L$87)","v":0},{"$f":"SUMIF($J$28:$J$87,\"Project Evaluation\",M$28:M$87)","v":0},{"$f":"SUMIF($J$28:$J$87,\"Project Evaluation\",N$28:N$87)","v":0},{"$f":"SUMIF($J$28:$J$87,\"Project Evaluation\",O$28:O$87)","v":0},0,{"$f":"SUMIF($J$28:$J$87,\"Project Evaluation\",Q$28:Q$87)","v":0},0,0,0,0,0,0,0,0,{"$f":"SUMIF($J$28:$J$53,\"Project Evaluation\",Z$28:Z$53)","v":0}]
[null,5,"INN Project Direct",null,null,0,{"$f":"SUMIF($J$28:$J$87,\"Project Direct\",L$28:L$87)","v":0},{"$f":"SUMIF($J$28:$J$87,\"Project Direct\",M$28:M$87)","v":0},{"$f":"SUMIF($J$28:$J$87,\"Project Direct\",N$28:N$87)","v":0},{"$f":"SUMIF($J$28:$J$87,\"Project Direct\",O$28:O$87)","v":0},0,{"$f":"SUMIF($J$28:$J$87,\"Project Direct\",Q$28:Q$87)","v":0},0,0,0,0,0,0,0,0,{"$f":"SUMIF($J$28:$J$53,\"Project Direct\",Z$28:Z$53)","v":0}]
[null,6,"INN Project Subtotal",null,null,{"$f":"SUM(F16:F18)","v":0},{"$f":"SUM(G16:G18)","v":0},{"$f":"SUM(H16:H18)","v":0},{"$f":"SUM(I16:I18)","v":0},{"$f":"SUM(J16:J18)","v":0},{"$f":"SUM(L19,M19:U19)","v":0},{"$f":"SUM(L16:L18)","v":0},{"$f":"SUM(M16:M18)","v":0},{"$f":"SUM(N16:N18)","v":0},{"$f":"SUM(O16:O18)","v":0},{"$f":"SUM(P16:P18)","v":0},{"$f":"SUM(Q16:Q18)","v":0},{"$f":"SUM(R16:R18)","v":0},{"$f":"SUM(S16:S18)","v":0},{"$f":"SUM(T16:T18)","v":0},{"$f":"SUM(U16:U18)","v":0}]
[null,7,"Total Innovation Expenditures",null,null,{"$f":"SUM(F14:F15,F16:F18)","v":0},0,0,0,0,0,0,0,0,0,0,0,0,0,0,0]
{"$rows_left_out":68}
{"sheet":"6. WET","index":7,"n_rows":33,"n_cols":24,"rows_kept":33,"cut":false,"hidden":false,"merged":[[13,2,13,4],[26,11,26,23],[11,6,11,9],[11,10,11,22],[20,2,20,4],[16,2,16,4],[17,2,17,4],[14,2,14,4],[15,2,15,4],[19,2,19,4],[26,7,26,10],[26,2,26,6],[18,2,18,4]]}
[null,"Back to Summary"]
[]
[null,"Annual Mental Health Services Act Revenue and Expenditure Report             "]
[null,"Fiscal Year 2016-17"]
[null,"Workforce Education and Training (WET) Summary"]
[]
[null,null,"County:",{"$f":"IF(ISBLANK('1. Information'!D6),\"\",'1. Information'!D6)","v":"Sierra"},null,"Date:",{"$f":"IF(ISBLANK('1. Information'!D5),\"\",'1. Information'!D5)","v":"2018-06-27"}]
[]
[null,"SECTION ONE"]
[]
[null,null,null,null,null,"A","B","C","D","E","F","G","H","I","J","K","L","M","N","O","P","Q","R"]
[null,null,null,null,null,null,"Other Fund",null,null,null,"MHSA Fund"]
[null,null,null,null,null,"Total","Medi-Cal FFP","1991 Realignment","Behavioral Health Subaccount","Other Funding","Total MHSA WET (Including Interest)","MHSA Interest","MHSA WET 2016-17","MHSA WET 2015-16","MHSA WET 2014-15","MHSA WET 2013-14","MHSA WET 2012-13","MHSA WET 2011-12","MHSA WET 2010-11","MHSA WET 2009-10","MHSA WET 2008-09","MHSA WET 2007-08","MHSA WET 2006-07"]
[null,1,"WET Annual Planning Costs",null,null,{"$f":"SUM(G14:J14,K14)","v":0},null,null,null,null,{"$f":"SUM(L14,M14:W14)","v":0}]
[null,2,"WET Evaluation Costs",null,null,{"$f":"SUM(G15:J15,K15)","v":0},null,null,null,null,{"$f":"SUM(L15,M15:W15)","v":0}]
[null,3,"WET Administration Costs",null,null,{"$f":"SUM(G16:J16,K16)","v":5820},null,null,null,null,{"$f":"SUM(L16,M16:W16)","v":5820},null,5820]
[null,4,"WET Funds Transferred to JPA",null,null,{"$f":"SUM(G17:J17,K17)","v":0},null,null,null,null,{"$f":"SUM(L17,M17:W17)","v":0}]
[null,5,"WET Expenditure Incurred by JPA",null,null,0,null,null,null,null,0]
[null,6,"WET Program Expenditures",null,null,{"$f":"SUM(G19:J19,K19)","v":32335},{"$f":"SUM(H29:H33)","v":0},0,0,{"$f":"SUM(K29:K33)","v":0},{"$f":"SUM(L19,M19:W19)","v":32335},{"$f":"SUM(M29:M33)","v":0},32335,0,0,0,0,0,0,0,0,{"$f":"SUM(W29:W33)","v":0},{"$f":"SUM(X29:X33)","v":0}]
[null,7,"Total WET Expenditures (Excluding Transfers to JPA)",null,null,{"$f":"SUM(F14:F16,F18:F19)","v":38155},{"$f":"SUM(G14:G16,G18:G19)","v":0},{"$f":"SUM(H14:H16,H18:H19)","v":0},0,0,38155,0,38155,0,0,0,0,0,0,0,0,0,0]
{"$rows_left_out":14}
{"sheet":"7. CFTN","index":8,"n_rows":48,"n_cols":24,"rows_kept":48,"cut":false,"hidden":false,"merged":[[11,6,11,9],[0,1,0,3],[11,10,11,22],[26,7,26,10],[26,11,26,23],[13,2,13,4],[15,2,15,4],[16,2,16,4],[17,2,17,4],[20,2,20,4],[19,2,19,4],[14,2,14,4],[26,2,26,6],[18,2,18,4],[21,2,21,4]]}
[null,"Back to Summary"]
[]
[null,"Annual Mental Health Services Act Revenue and Expenditure Report     "]
[null,"Fiscal Year 2016-17"]
[null,"Capital Facility Technological Needs (CFTN) Summary"]
[]
[null,"County:",null,{"$f":"IF(ISBLANK('1. Information'!D6),\"\",'1. Information'!D6)","v":"Sierra"},null,"Date:",{"$f":"IF(ISBLANK('1. Information'!D5),\"\",'1. Information'!D5)","v":"2018-06-27"}]
[]
[null,"SECTION ONE"]
[]
[null,null,null,null,null,"A","B","C","D","E","F","G","H","I","J","K","L","M","N","O","P","Q","R"]
[null,null,null,null,null,null,"Other Fund",null,null,null,"MHSA Funds"]
[null,null,null,null,null,"Total","Medi-Cal FFP","1991 Realignment","Behavioral Health Subaccount","Other Funding","Total MHSA CFTN","MHSA Interest","MHSA CFTN 2016-17","MHSA CFTN 2015-16","MHSA CFTN 2014-15","MHSA CFTN 2013-14","MHSA CFTN 2012-13","MHSA CFTN 2011-12","MHSA CFTN 2010-11","MHSA CFTN 2009-10","MHSA CFTN 2008-09","MHSA CFTN 2007-08","MHSA CFTN 2006-07"]
[null,1,"CF Annual Planning Costs",null,null,{"$f":"SUM(G14:J14,K14)","v":0},null,null,null,null,{"$f":"SUM(L14,M14:W14)","v":0}]
[null,2,"TN Annual Planning Costs",null,null,0,null,null,null,null,{"$f":"SUM(L15,M15:W15)","v":0}]
[null,3,"CF Evaluation Costs",null,null,0,null,null,null,null,0]
[null,4,"TN Evaluation Costs",null,null,0,null,null,null,null,0]
[null,5,"CF Administration",null,null,910,null,null,null,null,910,910]
[null,6,"TN Administration",null,null,0,null,null,null,null,0]
[null,7,"CFTN Program Expenditure",null,null,5055,{"$f":"SUM(H29:H48)","v":0},{"$f":"SUM(I29:I48)","v":0},{"$f":"SUM(J29:J48)","v":0},{"$f":"SUM(K29:K48)","v":0},5055,{"$f":"SUM(M29:M48)","v":5055},0,0,0,0,0,0,0,0,0,0,0]
{"$rows_left_out":29}
{"sheet":"8. TTACB, WET RP, HP","index":9,"n_rows":16,"n_cols":22,"rows_kept":16,"cut":false,"hidden":false,"merged":[[11,9,11,21],[0,1,0,3],[6,1,6,2],[11,2,11,4],[11,5,11,8]]}
[null,"Back to Summary"]
[]
[null,"Annual Mental Health Services Act Revenue and Expenditure Report"]
[null,"Fiscal Year 2016-17"]
[null,"TTACB, WET RP, MHSA HP Summary"]
[]
[null,"County:",null,{"$f":"IF(ISBLANK('1. Information'!D6),\"\",'1. Information'!D6)","v":"Sierra"},null,"Date:",{"$f":"IF(ISBLANK('1. Information'!D5),\"\",'1. Information'!D5)","v":"2018-06-27"}]
[]
[null,"SECTION ONE"]
[]
[null,null,"A","B","C","D","E","F","G","H","I","J","K","L","M","N","O","P","Q","R","S","T"]
[null,null,"TTACB, WET RP, PE SW, HP Component",null,null,"Other Funds",null,null,null,"MHSA Funds"]
[null,"#","County Code","Funding Type","Expenditures","Medi-Cal FFP","1991 Realignment","Behavorial Health Subaccount","Other Funding","Total MHSA TTACB, WET RP, HP","MHSA Interest"," TTACB, WET RP,  HP 2016-17"," TTACB, WET RP, HP 2015-16"," TTACB, WET RP, HP 2014-15"," TTACB, WET RP, HP 2013-14"," TTACB, WET RP, HP 2012-13"," TTACB, WET RP, HP 2011-12"," TTACB, WET RP, HP 2010-11"," TTACB, WET RP, HP 2009-10"," TTACB, WET RP, HP 2008-09"," TTACB, WET RP, HP 2007-08"," TTACB, WET RP, HP 2006-07"]
[null,1,{"$f":"IF(AND(NOT(COUNTA(F14:I14)),(NOT(COUNTA(L14:V14)))),\"\",VLOOKUP($D$7,Info_County_Code,2,FALSE))","v":""},"Training, Technical Assistance & Capacity Building (TTACB)",{"$f":"SUM(F14:I14,J14)","v":0},null,null,null,null,{"$f":"SUM(K14,L14:V14)","v":0}]
[null,2,{"$f":"IF(AND(NOT(COUNTA(F15:I15)),(NOT(COUNTA(L15:V15)))),\"\",VLOOKUP($D$7,Info_County_Code,2,FALSE))","v":""},"WET Regional Partnerships (WET RP)",{"$f":"SUM(F15:I15,J15)","v":0},null,null,null,null,{"$f":"SUM(K15,L15:V15)","v":0}]
[null,3,{"$f":"IF(AND(NOT(COUNTA(F16:I16)),(NOT(COUNTA(L16:V16)))),\"\",VLOOKUP($D$7,Info_County_Code,2,FALSE))","v":""},"MHSA Housing Program (Unencumbered Funds)",{"$f":"SUM(F16:I16,J16)","v":0},null,null,null,null,0]

{"sheet":"9. Adjustment (MHSA)","index":10,"n_rows":112,"n_cols":7,"rows_kept":112,"cut":false,"hidden":false,"merged":[[6,1,6,2]]}
[null,"Back to Summary"]
[]
[null,"Annual Mental Health Services Act Revenue and Expenditure Report"]
[null,"Fiscal Year 2016-17"]
[null,"Adjustments Worksheet (MHSA)"]
[]
[null,"County:",null,{"$f":"IF(ISBLANK('1. Information'!D6),\"\",'1. Information'!D6)","v":"Sierra"},null,"Date",{"$f":"IF(ISBLANK('1. Information'!D5),\"\",'1. Information'!D5)","v":"2018-06-27"}]
[]
[null,"SECTION ONE"]
[]
[null,null,"A","B","C","D","E"]
[null,"#","County","Component","Adjustment to FY","Amount","Reason"]
[null,1,{"$f":"IF(NOT(COUNTA(D13:G13)),\"\",VLOOKUP($D$7,Info_County_Code,2,FALSE))","v":""}]
[null,2,""]
[null,3,""]
[null,4,""]
[null,5,""]
[null,6,""]
[null,7,""]
[null,8,""]
{"$rows_left_out":93}
{"sheet":"10. Adjustment (FFP)","index":11,"n_rows":52,"n_cols":9,"rows_kept":52,"cut":false,"hidden":false,"merged":[[6,1,6,2],[0,1,0,3]]}
[null,"Back to Summary"]
[]
[null,"Annual Mental Health Services Act Revenue and Expenditure Report          "]
[null,"Fiscal Year 2016-17"]
[null,"FFP Revenue Adjustment"]
[]
[null,"County:",null,{"$f":"IF(ISBLANK('1. Information'!D6),\"\",'1. Information'!D6)","v":"Sierra"},null,"Date:",{"$f":"IF(ISBLANK('1. Information'!D5),\"\",'1. Information'!D5)","v":"2018-06-27"}]
[]
[null,"SECTION ONE"]
[]
[null,null,"A","B","C","D","E","F","G"]
[null,"#","County","Fiscal Year","Cost Report Stage","Component","Beginning Balance","Adjustment Amount","Ending Balance"]
[null,1,{"$f":"IF(NOT(COUNTA(G13:H13)),\"\",VLOOKUP($D$7,Info_County_Code,2,FALSE))","v":""},"FY 2006-07",null,"CSS",null,null,{"$f":"SUM(G13:H13)","v":0}]
[null,2,"","FY 2007-08",null,"CSS",null,null,{"$f":"SUM(G14:H14)","v":0}]
[null,3,"","FY 2008-09",null,"CSS",null,null,0]
[null,4,"","FY 2009-10",null,"CSS",null,null,0]
[null,5,"","FY 2010-11",null,"CSS",null,null,0]
[null,6,"","FY 2011-12",null,"CSS",null,null,0]
[null,7,"","FY 2012-13",null,"CSS",null,null,0]
[null,8,"","FY 2013-14",null,"CSS",null,null,0]
{"$rows_left_out":33}
{"sheet":"11. Comments","index":12,"n_rows":47,"n_cols":3,"rows_kept":47,"cut":false,"hidden":false,"merged":[[0,0,0,2]]}
["Back to Summary"]
[]
[null,"Annual Mental Health Services Act Revenue and Expenditure Report          "]
[null,"Fiscal Year 2016-17"]
[null,"Comments"]
[]
[null,null,"Comments"]
[null,1]
[null,2]
[null,3]
[null,4]
[null,5]
[null,6]
[null,7]
[null,8]
[null,9]
[null,10]
[null,11]
[null,12]
[null,13]
{"$rows_left_out":28}
{"sheet":"drop down fields","index":13,"n_rows":60,"n_cols":13,"rows_kept":60,"cut":false,"hidden":false,"merged":[[0,0,0,1]]}
["Info_County_Code",null,"Info_Population","CSS_Service_Category","PEI_Combined_Standalone","PEI_Program_Type","INN_Expenditure_Type","WET_Funding_Category","CFTN_Project_Type","Adjustment_MHSA_Component","Adjustment_FY","Adjustment_Reason","Cost_Report_Stage"]
["Alameda",1,"Yes","FSP","Combined","Prevention","Project","Workforce Staffing","Capital Facility","CSS","FY 2006-07","Cost Report Reconciliation","Audited"]
["Alpine",2,"No","Non-FSP","Standalone","Early Intervention","Project Administration","Training/Technical Assistance","Technological Need","PEI","FY 2007-08","Cost Report Audit","Settled"]
["Amador",3,null,null,null,"Outreach","Project Evaluation","MH Career Pathways",null,"INN","FY 2008-09","SDMC Chart Audit","Initial"]
["Berkeley City",65,null,null,null,"Stigma & Discrimination Reduction",null,"Residency/Internship",null,"WET","FY 2009-10","Local Quality Assurance Audit"]
["Butte",4,null,null,null,"Suicide Prevention",null,"Financial Incentive",null,"CFTN","FY 2010-11","Error"]
["Calaveras",5,null,null,null,"Access and Linkage",null,null,null,"TTACB","FY 2011-12","Other"]
["Colusa",6,null,null,null,"Improving Timely Access",null,null,null,"WET RP","FY 2012-13"]
["Contra Costa",7,null,null,null,"Combined Summary",null,null,null,"PEI SW","FY 2013-14"]
["Del Norte",8,null,null,null,null,null,null,null,"MHSA HP","FY 2014-15"]
["El Dorado",9,null,null,null,null,null,null,null,"Prudent Reserve","FY 2015-16"]
["Fresno",10,null,null,null,null,null,null,null,null,"FY 2016-17"]
["Glenn",11]
["Humboldt",12]
["Imperial",13]
["Inyo",14]
["Kern",15]
["Kings",16]
["Lake",17]
["Lassen",18]
{"$rows_left_out":41}
{"sheet":"E-1 CountyState2017","index":14,"n_rows":82,"n_cols":5,"rows_kept":82,"cut":false,"hidden":false,"merged":[[4,1,4,2],[1,0,1,4],[2,0,2,4]]}
[null,null,null,"About the Data"]
["E-1: State/County Population Estimates with Annual Percent Change"]
["January 1, 2016 and 2017"]
[]
["State/County","           Total Population",null,"Percent"]
[null,"2016-01-01","2017-01-01","Change","County Population:  Over 200,000? (Yes or No)"]
[]
["California",39189035,39523613,0.9]
[]
["Alameda",1629233,1645359,1,{"$f":"IF(B10>=200000,\"Yes\", \"No\")","v":"Yes"}]
["Alpine",1160,1151,-0.8,{"$f":"IF(B11>=200000,\"Yes\", \"No\")","v":"No"}]
["Amador",37667,38382,1.9,"No"]
["Butte",224703,226404,0.8,"Yes"]
["Calaveras",45246,45168,-0.2,"No"]
["Colusa",21965,22043,0.4,"No"]
["Contra Costa",1126824,1139513,1.1000000000000001,"Yes"]
["Del Norte",27006,27124,0.4,"No"]
["El Dorado",184371,185062,0.4,"No"]
["Fresno",985079,995975,1.1000000000000001,"Yes"]
["Glenn",28639,28731,0.3,"No"]
{"$rows_left_out":62}