{"text_format":"1","workbook":"xlsx","n_sheets":15,"sheets":["DHCS Only","Instructions","1. Information","2. Component Summary","3. CSS","4. PEI","5. INN","6. WET","7. CFTN","8. TTACB, WET RP, HP","9. Adjustment (MHSA)","10. Adjustment (FFP)","11. Comments","drop down fields","E-1 CountyState2017"],"not_rendered":{"charts":0,"images":0,"macros":1,"external_links":0,"defined_names":28,"comments":0,"pivot_tables":0},"unopened":[],"bounds":{"document_bytes":16777216,"sheet_cells":100000,"rows_first":2000,"rows_last":500,"rows_between":2000,"halvings":0,"cell_chars":16384,"cell_head_chars":4096},"cells_cut":0,"cells_raw":0,"read":"whole","date_system":"1900"}

{"sheet":"DHCS Only","index":0,"n_rows":3,"n_cols":1,"rows_kept":3,"cut":false,"hidden":true,"merged":[]}
["For DHCS use only."]
["Click button to lock or unlock all sheets for editing. "]
["This tab should be hidden when not in use. "]

{"sheet":"Instructions","index":1,"n_rows":16,"n_cols":3,"rows_kept":16,"cut":false,"hidden":false,"merged":[[11,1,13,1],[9,1,10,1],[9,2,10,2],[4,1,4,2],[5,1,5,2],[6,1,6,2],[7,1,7,2]]}
[null,"Annual Mental Health Services Act Revenue and Expenditure Report"]
[null,"Fiscal Year 2016-17"]
[null,"ARER Instructions (v. 01/25/2018)"]
[]
[null,"• For detailed instructions, see Enclosure 2: Instruction Manual for Fiscal Year 2016-17 of the MHSA Annual Revenue and Expenditure Report. "]
[null,"• These worksheets are used to report the total expenditures for each MHSA-funded program. Expenditures should be recognized in the period that the fund liability is incurred. (Accounting Standards and Procedures for Counties, State Controller’s Office (SCO), May 2014). "]
[null,"• Counties must report any expenditure that occurred between July 1, 2016 and June 30, 2017, on the appropriate component worksheet."]
[null,"• Counties should reflect total (gross) program expenditures for each MHSA program on the MHSA Component Expenditure Worksheets."]
[]
[null,"Step 1: Complete the Information worksheet","The information provided on the Information worksheet automatically links to worksheets in the ARER.  This worksheet eliminates the redundant entry of county name, code, and date on worksheets. "]
[]
[null,"Step 2: Complete section one and two of the Component Summary worksheet","Section one provides the total amount of unspent funds available from prior fiscal years.  These amounts should match the amount of unspent funds previously reported in the FY 2015-16 ARER, Unspent MHSA Funds in the Local Mental Health Service (MHS) Fund (Section 6)."]
[null,null,"Section two provides the total amount of revenue received and deposited into the local MHS Fund from July 1, 2016 through June 30, 2017."]
[null,null,"Skip section three through seven of the Component Summary worksheet. These sections are linked to the remaining component worksheets and will auto populate as the county completes each individual worksheet."]
[null,"Step 3: Complete each component and adjustment worksheet","In general, counties will enter expenditure data in the blue boxes throughout the workbook. Cells shaded gray will require no data entry because it is an excel formula or data is not relevant for that particular cell."]
[null,"Step 4: Review the Component Summary worksheet","Counties should verify that sections three through seven of the Component Summary worksheet accurately reflect the expenditures reported on the component and adjustment worksheets."]

{"sheet":"1. Information","index":2,"n_rows":15,"n_cols":4,"rows_kept":15,"cut":false,"hidden":false,"merged":[]}
[null,"Annual Mental Health Services Act Revenue and Expenditure Report"]
[null,"Fiscal Year 2016-17"]
[null,"Information"]
[]
[null,1,"Date:","2018-06-27"]
[null,2,"County:","Sierra"]
[null,3,"County Code:",{"$f":"IF(ISBLANK(D6),\"\",VLOOKUP(D6,Info_County_Code,2))","v":46}]
[null,4,"Address:","207 Front Street"]
[null,5,"City:","Loyalton"]
[null,6,"Zip:",96118]
[null,7,"County Population:  Over 200,000? (Yes or No)",{"$f":"IF(ISBLANK(D6),\"\",VLOOKUP(D6,County_Population,5,FALSE))","v":"No"}]
[null,8,"Name of Preparer:","Judy Blakney"]
[null,9,"Title of Preparer:","Fiscal Officer"]
[null,10,"Preparer Contact Email:","jblakney@sierracounty.ca.gov"]
[null,11,"Preparer Contact Telephone","(530) 993-6720"]

{"sheet":"2. Component Summary","index":3,"n_rows":103,"n_cols":14,"rows_kept":103,"cut":false,"hidden":false,"merged":[[4,1,4,2],[61,1,61,2],[76,1,76,2],[55,1,55,2]]}
[null,"Annual Mental Health Services Act Revenue and Expenditure Report"]
[null,"Fiscal Year 2016-17"]
[null,"Component Summary "]
[]
[null,"County:",null,{"$f":"IF(ISBLANK('1. Information'!D6),\"\",'1. Information'!D6)","v":"Sierra"},null,"Date:",{"$f":"IF(ISBLANK('1. Information'!D5),\"\",'1. Information'!D5)","v":"2018-06-27"}]
[]
[null,null,null,null,"A"]
[null,null,null,null,"% of revenue "]
[null,1,"Total Annual Planning Costs",{"$f":"'3. CSS'!F14+'4. PEI'!F14+'5. INN'!F14+'6. WET'!F14+'7. CFTN'!F14","v":3978},{"$f":"IF(AND(N33>0,D9>0),D9/N33,\"\")","v":2.5848809804613409E-3},"Total MHSA costs for planning for all components may not exceed 5 percent of the total annual MHSA revenues received by the County"]
[null,2,"Total Evaluation Costs",{"$f":"'3. CSS'!F15+'4. PEI'!F15+'5. INN'!F17+'6. WET'!F15+'7. CFTN'!F16+'7. CFTN'!F17","v":0}]
[null,3,"Total Administration",{"$f":"'3. CSS'!F16+'4. PEI'!F16+'5. INN'!F15+'5. INN'!F16+'6. WET'!F16+'7. CFTN'!F18+'7. CFTN'!F19","v":196903}]
[]
[null,null,null,"A","B","C","D","E","F","G","H","I","J","K"]
[null,null,null,"CSS","PEI","INN","WET","CFTN","TTACB","WET RP","PEI SW","MHSA HP","PR","TOTAL"]
[null,"SECTION 1: Unspent MHSA Funds Available in the MHS Fund From Prior Fiscal Years"]
[null,1,"Local Prudent Reserve",null,null,null,null,null,null,null,null,null,793611,{"$f":"M16","v":793611}]
[null,2,"FY 2006-07",null,null,null,null,null,null,null,null,null,null,{"$f":"SUM(D17:L17)","v":0}]
[null,3,"FY 2007-08",null,null,null,null,359152,null,null,null,null,null,{"$f":"SUM(D18:L18)","v":359152}]
[null,4,"FY 2008-09",null,null,63500,null,180910,400,null,null,null,null,244810]
[null,5,"FY 2009-10",null,213500,63500,null,null,400,null,null,null,null,277400]
[null,6,"FY 2010-11",267794,135344,110900,null,null,400,null,25000,null,null,539438]
[null,7,"FY 2011-12",0,119585,45400,null,null,400,null,25000,null,null,190385]
[null,8,"FY 2012-13",54121,296249,74920,null,null,null,null,null,null,null,425290]
[null,9,"FY 2013-14",121715,230296,57574,null,null,null,null,null,null,null,409585]
[null,10,"FY 2014-15",1011902,322362,80590,null,null,null,null,null,null,null,1414854]
[null,11,"FY 2015-16",1103144,294172,73543,-14308,null,null,null,null,null,null,1456551]
[null,12,"Interest",20926,23334,11443,null,{"$f":"3089+3421","v":6510},41,null,8,null,20640,{"$f":"SUM(D27:M27)","v":82902}]
[null,13,"TOTAL",{"$f":"SUM(D16:D27)","v":2579602},1634842,581370,-14308,546572,1641,0,50008,0,814251,{"$f":"SUM(D28:M28)","v":6193978}]
[null,"SECTION 2: MHSA Funds Received in FY 2016-17 (Revenue)"]
[null,1,"Transfer from Local Prudent Reserve",null,null,null,null,null,null,null,null,null,{"$f":"(-D30-E30)","v":0},{"$f":"SUM(D30:M30)","v":0}]
[null,2,"FY 2016-17 MHSA Funds",1109542,295878,73969,null,null,null,null,null,null,null,{"$f":"SUM(D31:M31)","v":1479389}]
[null,3,"FY 2016-17 Interest Earned on local MHS Fund",25497,14965,6037,null,5822,12,null,null,null,7227,{"$f":"SUM(D32:M32)","v":59560}]
[null,4,"TOTAL",{"$f":"SUM(D30:D32)","v":1135039},{"$f":"SUM(E30:E32)","v":310843},80006,0,5822,12,0,0,0,7227,{"$f":"SUM(D33:M33)","v":1538949}]
[null,"SECTION 3: Program Expenditures and Sources of Funding 2016-17"]
[null,1,"MHSA Funds"]
[null,2,"FY 2006-07",null,null,null,{"$f":"'6. WET'!W20","v":0},null,null,null,null,null,null,{"$f":"SUM(D36:M36)","v":0}]
[null,3,"FY 2007-08",null,null,null,{"$f":"'6. WET'!V20","v":0},{"$f":"'7. CFTN'!V21","v":0},null,null,null,null,null,{"$f":"SUM(D37:M37)","v":0}]
[null,4,"FY 2008-09",null,null,{"$f":"'5. INN'!U20","v":0},{"$f":"'6. WET'!U20","v":0},{"$f":"'7. CFTN'!U21","v":0},{"$f":"'8. TTACB, WET RP, HP'!T14","v":0},{"$f":"'8. TTACB, WET RP, HP'!T15","v":0},{"$f":"'4. PEI'!U17","v":0},null,null,0]
[null,5,"FY 2009-10",null,null,{"$f":"'5. INN'!T20","v":0},{"$f":"'6. WET'!T20","v":0},{"$f":"'7. CFTN'!T21","v":0},{"$f":"'8. TTACB, WET RP, HP'!S14","v":0},{"$f":"'8. TTACB, WET RP, HP'!S15","v":0},{"$f":"'4. PEI'!T17","v":0},null,null,0]
[null,6,"FY 2010-11",null,null,{"$f":"'5. INN'!S20","v":0},{"$f":"'6. WET'!S20","v":0},{"$f":"'7. CFTN'!S21","v":0},{"$f":"'8. TTACB, WET RP, HP'!R14","v":0},{"$f":"'8. TTACB, WET RP, HP'!R15","v":0},{"$f":"'4. PEI'!S17","v":0},null,null,0]
[null,7,"FY 2011-12",null,null,{"$f":"'5. INN'!R20","v":0},{"$f":"'6. WET'!R20","v":0},{"$f":"'7. CFTN'!R21","v":0},{"$f":"'8. TTACB, WET RP, HP'!Q14","v":0},{"$f":"'8. TTACB, WET RP, HP'!Q15","v":0},{"$f":"'4. PEI'!R17","v":0},null,null,0]
[null,8,"FY 2012-13",null,null,{"$f":"'5. INN'!Q20","v":0},{"$f":"'6. WET'!Q20","v":0},{"$f":"'7. CFTN'!Q21","v":0},null,{"$f":"'8. TTACB, WET RP, HP'!P15","v":0},null,null,null,0]
[null,9,"FY 2013-14",null,null,{"$f":"'5. INN'!P20","v":0},{"$f":"'6. WET'!P20","v":0},{"$f":"'7. CFTN'!P21","v":0},null,{"$f":"'8. TTACB, WET RP, HP'!O15","v":0},null,null,null,0]
[null,10,"FY 2014-15",{"$f":"SUM('3. CSS'!O14:O16,'3. CSS'!O18,'3. CSS'!O23)","v":879147},{"$f":"'4. PEI'!O21","v":189954},{"$f":"'5. INN'!O20","v":0},{"$f":"'6. WET'!O20","v":0},{"$f":"'7. CFTN'!O21","v":0},null,{"$f":"'8. TTACB, WET RP, HP'!N15","v":0},null,{"$f":"'8. TTACB, WET RP, HP'!N16","v":0},null,1069101]
[null,11,"FY 2015-16",{"$f":"SUM('3. CSS'!N14:N16,'3. CSS'!N18,'3. CSS'!N23)","v":0},{"$f":"'4. PEI'!N21","v":0},{"$f":"'5. INN'!N20","v":0},{"$f":"'6. WET'!N20","v":0},{"$f":"'7. CFTN'!N21","v":0},null,{"$f":"'8. TTACB, WET RP, HP'!M15","v":0},null,{"$f":"'8. TTACB, WET RP, HP'!M16","v":0},null,0]
[null,12,"FY 2016-17",{"$f":"SUM('3. CSS'!M14:M16,'3. CSS'!M18,'3. CSS'!M23)","v":0},{"$f":"'4. PEI'!M21","v":0},{"$f":"'5. INN'!M20","v":0},{"$f":"'6. WET'!M20","v":38155},{"$f":"'7. CFTN'!M21","v":0},null,{"$f":"'8. TTACB, WET RP, HP'!L15","v":0},null,{"$f":"'8. TTACB, WET RP, HP'!L16","v":0},null,{"$f":"SUM(D46:M46)","v":38155}]
[null,13,"MHSA Interest",{"$f":"'3. CSS'!L24","v":10083},{"$f":"'4. PEI'!L21","v":7448},{"$f":"'5. INN'!L20","v":0},{"$f":"'6. WET'!L20","v":0},{"$f":"'7. CFTN'!L21","v":5965},{"$f":"'8. TTACB, WET RP, HP'!K14","v":0},{"$f":"'8. TTACB, WET RP, HP'!K15","v":0},{"$f":"'4. PEI'!L17","v":0},{"$f":"'8. TTACB, WET RP, HP'!K16","v":0},null,{"$f":"SUM(D47:M47)","v":23496}]
[null,14,"MHSA Net Expenditure Subtotal for FY 2016-17",{"$f":"SUM(D36:D47)","v":889230},{"$f":"SUM(E36:E47)","v":197402},0,38155,5965,0,0,0,0,null,{"$f":"SUM(D48:M48)","v":1130752}]
[null,15,"Other Funds"]
[null,16,"1991 Realignment",{"$f":"'3. CSS'!H24","v":0},{"$f":"'4. PEI'!H21","v":0},{"$f":"'5. INN'!H20","v":0},{"$f":"'6. WET'!H20","v":0},{"$f":"'7. CFTN'!H21","v":0},{"$f":"'8. TTACB, WET RP, HP'!G14","v":0},{"$f":"'8. TTACB, WET RP, HP'!G15","v":0},{"$f":"'4. PEI'!H17","v":0},{"$f":"'8. TTACB, WET RP, HP'!G16","v":0},null,{"$f":"SUM(D50:M50)","v":0}]
[null,17,"Behavioral Health Subaccount",{"$f":"'3. CSS'!I24","v":0},{"$f":"'4. PEI'!I21","v":0},{"$f":"'5. INN'!I20","v":0},{"$f":"'6. WET'!I20","v":0},{"$f":"'7. CFTN'!I21","v":0},{"$f":"'8. TTACB, WET RP, HP'!H14","v":0},{"$f":"'8. TTACB, WET RP, HP'!H15","v":0},{"$f":"'4. PEI'!I17","v":0},{"$f":"'8. TTACB, WET RP, HP'!H16","v":0},null,{"$f":"SUM(D51:M51)","v":0}]
[null,18,"FFP Revenue",{"$f":"'3. CSS'!G24","v":0},{"$f":"'4. PEI'!G21","v":0},{"$f":"'5. INN'!G20","v":0},{"$f":"'6. WET'!G20","v":0},{"$f":"'7. CFTN'!G21","v":0},{"$f":"'8. TTACB, WET RP, HP'!F14","v":0},{"$f":"'8. TTACB, WET RP, HP'!F15","v":0},{"$f":"'4. PEI'!G17","v":0},{"$f":"'8. TTACB, WET RP, HP'!F16","v":0},null,{"$f":"SUM(D52:M52)","v":0}]
[null,19,"Other",{"$f":"'3. CSS'!J24","v":0},{"$f":"'4. PEI'!J21","v":0},{"$f":"'5. INN'!J20","v":0},{"$f":"'6. WET'!J20","v":0},{"$f":"'7. CFTN'!J21","v":0},{"$f":"'8. TTACB, WET RP, HP'!I14","v":0},{"$f":"'8. TTACB, WET RP, HP'!I15","v":0},{"$f":"'4. PEI'!J17","v":0},{"$f":"'8. TTACB, WET RP, HP'!I16","v":0},null,0]
[null,20,"MHSA Other Funds Expenditure Subtotal for FY 2016-17",{"$f":"SUM(D50:D53)","v":0},{"$f":"SUM(E50:E53)","v":0},0,0,0,0,0,0,0,null,0]
[null,21,"TOTAL MHSA and Other Funding Sources",{"$f":"D48+D54","v":889230},{"$f":"E48+E54","v":197402},0,38155,5965,0,0,0,0,null,1130752]
[null,"SECTION 4: Transfers to Prudent Reserve, WET or CFTN"]
[null,1,"FY 2014-15",{"$f":"(G57+H57+M57)*-1","v":0},null,null,{"$f":"'3. CSS'!O20","v":0},{"$f":"'3. CSS'!O21","v":0},null,null,null,null,{"$f":"'3. CSS'!O22","v":0},{"$f":"SUM(D57:M57)","v":0}]
[null,2,"FY 2015-16",{"$f":"(G58+H58+M58)*-1","v":0},null,null,{"$f":"'3. CSS'!N20","v":0},{"$f":"'3. CSS'!N21","v":0},null,null,null,null,{"$f":"'3. CSS'!N22","v":0},{"$f":"SUM(D58:M58)","v":0}]
[null,3,"FY 2016-17",{"$f":"(G59+H59+M59)*-1","v":0},null,null,{"$f":"'3. CSS'!M20","v":0},{"$f":"'3. CSS'!M21","v":0},null,null,null,null,{"$f":"'3. CSS'!M22","v":0},0]
[null,4,"Interest",{"$f":"(G60+H60+M60)*-1","v":0},null,null,{"$f":"'3. CSS'!L20","v":0},{"$f":"'3. CSS'!L21","v":0},null,null,null,null,{"$f":"'3. CSS'!L22","v":0},0]
[null,5,"TOTAL",{"$f":"SUM(D57:D60)","v":0},null,null,{"$f":"SUM(G57:G60)","v":0},{"$f":"SUM(H57:H60)","v":0},null,null,null,null,{"$f":"SUM(M57:M60)","v":0},0]
[null,"SECTION 5: Adjustments to MHSA Funds"]
[null,1,"Local Prudent Reserve",null,null,null,null,null,null,null,null,null,{"$f":"SUM('9. Adjustment (MHSA)'!E83:E112)","v":0},{"$f":"SUM(D63:M63)","v":0}]
[null,2,"FY 2006-07",{"$f":"SUMIFS('9. Adjustment (MHSA)'!$F$13:$F$42,'9. Adjustment (MHSA)'!$D$13:$D$42,\"CSS\",'9. Adjustment (MHSA)'!$E$13:$E$42,\"FY 2006-07\")","v":0},null,null,{"$f":"SUMIFS('9. Adjustment (MHSA)'!$F$13:$F$42,'9. Adjustment (MHSA)'!$D$13:$D$42,\"WET\",'9. Adjustment (MHSA)'!$E$13:$E$42,\"FY 2006-07\")","v":0},null,null,null,null,null,null,{"$f":"SUM(D64:M64)","v":0}]
[null,3,"FY 2007-08",{"$f":"SUMIFS('9. Adjustment (MHSA)'!$F$13:$F$42,'9. Adjustment (MHSA)'!$D$13:$D$42,\"CSS\",'9. Adjustment (MHSA)'!$E$13:$E$42,\"FY 2007-08\")","v":0},null,null,{"$f":"SUMIFS('9. Adjustment (MHSA)'!$F$13:$F$42,'9. Adjustment (MHSA)'!$D$13:$D$42,\"WET\",'9. Adjustment (MHSA)'!$E$13:$E$42,\"FY 2007-08\")","v":0},{"$f":"SUMIFS('9. Adjustment (MHSA)'!$F$13:$F$42,'9. Adjustment (MHSA)'!$D$13:$D$42,\"CFTN\",'9. Adjustment (MHSA)'!$E$13:$E$42,\"FY 2007-08\")","v":0},null,null,null,null,null,{"$f":"SUM(D65:M65)","v":0}]
[null,4,"FY 2008-09",{"$f":"SUMIFS('9. Adjustment (MHSA)'!$F$13:$F$42,'9. Adjustment (MHSA)'!$D$13:$D$42,\"CSS\",'9. Adjustment (MHSA)'!$E$13:$E$42,\"FY 2008-09\")","v":0},{"$f":"SUMIFS('9. Adjustment (MHSA)'!$F$13:$F$42,'9. Adjustment (MHSA)'!$D$13:$D$42,\"PEI\",'9. Adjustment (MHSA)'!$E$13:$E$42,\"FY 2008-09\")","v":0},{"$f":"SUMIFS('9. Adjustment (MHSA)'!$F$13:$F$42,'9. Adjustment (MHSA)'!$D$13:$D$42,\"INN\",'9. Adjustment (MHSA)'!$E$13:$E$42,\"FY 2008-09\")","v":0},{"$f":"SUMIFS('9. Adjustment (MHSA)'!$F$13:$F$42,'9. Adjustment (MHSA)'!$D$13:$D$42,\"WET\",'9. Adjustment (MHSA)'!$E$13:$E$42,\"FY 2008-09\")","v":0},{"$f":"SUMIFS('9. Adjustment (MHSA)'!$F$13:$F$42,'9. Adjustment (MHSA)'!$D$13:$D$42,\"CFTN\",'9. Adjustment (MHSA)'!$E$13:$E$42,\"FY 2008-09\")","v":0},{"$f":"SUMIFS('9. Adjustment (MHSA)'!$F$13:$F$42,'9. Adjustment (MHSA)'!$D$13:$D$42,\"TTACB\",'9. Adjustment (MHSA)'!$E$13:$E$42,\"FY 2008-09\")","v":0},{"$f":"SUMIFS('9. Adjustment (MHSA)'!$F$13:$F$42,'9. Adjustment (MHSA)'!$D$13:$D$42,\"WET RP\",'9. Adjustment (MHSA)'!$E$13:$E$42,\"FY 2008-09\")","v":0},{"$f":"SUMIFS('9. Adjustment (MHSA)'!$F$13:$F$42,'9. Adjustment (MHSA)'!$D$13:$D$42,\"PEI SW\",'9. Adjustment (MHSA)'!$E$13:$E$42,\"FY 2008-09\")","v":0},null,null,0]
[null,5,"FY 2009-10",{"$f":"SUMIFS('9. Adjustment (MHSA)'!$F$13:$F$42,'9. Adjustment (MHSA)'!$D$13:$D$42,\"CSS\",'9. Adjustment (MHSA)'!$E$13:$E$42,\"FY 2009-10\")","v":0},{"$f":"SUMIFS('9. Adjustment (MHSA)'!$F$13:$F$42,'9. Adjustment (MHSA)'!$D$13:$D$42,\"PEI\",'9. Adjustment (MHSA)'!$E$13:$E$42,\"FY 2009-10\")","v":0},{"$f":"SUMIFS('9. Adjustment (MHSA)'!$F$13:$F$42,'9. Adjustment (MHSA)'!$D$13:$D$42,\"INN\",'9. Adjustment (MHSA)'!$E$13:$E$42,\"FY 2009-10\")","v":0},{"$f":"SUMIFS('9. Adjustment (MHSA)'!$F$13:$F$42,'9. Adjustment (MHSA)'!$D$13:$D$42,\"WET\",'9. Adjustment (MHSA)'!$E$13:$E$42,\"FY 2009-10\")","v":0},{"$f":"SUMIFS('9. Adjustment (MHSA)'!$F$13:$F$42,'9. Adjustment (MHSA)'!$D$13:$D$42,\"CFTN\",'9. Adjustment (MHSA)'!$E$13:$E$42,\"FY 2009-10\")","v":0},{"$f":"SUMIFS('9. Adjustment (MHSA)'!$F$13:$F$42,'9. Adjustment (MHSA)'!$D$13:$D$42,\"TTACB\",'9. Adjustment (MHSA)'!$E$13:$E$42,\"FY 2009-10\")","v":0},{"$f":"SUMIFS('9. Adjustment (MHSA)'!$F$13:$F$42,'9. Adjustment (MHSA)'!$D$13:$D$42,\"WET RP\",'9. Adjustment (MHSA)'!$E$13:$E$42,\"FY 2009-10\")","v":0},{"$f":"SUMIFS('9. Adjustment (MHSA)'!$F$13:$F$42,'9. Adjustment (MHSA)'!$D$13:$D$42,\"PEI SW\",'9. Adjustment (MHSA)'!$E$13:$E$42,\"FY 2009-10\")","v":0},null,null,0]
[null,6,"FY 2010-11",{"$f":"SUMIFS('9. Adjustment (MHSA)'!$F$13:$F$42,'9. Adjustment (MHSA)'!$D$13:$D$42,\"CSS\",'9. Adjustment (MHSA)'!$E$13:$E$42,\"FY 2010-11\")","v":0},{"$f":"SUMIFS('9. Adjustment (MHSA)'!$F$13:$F$42,'9. Adjustment (MHSA)'!$D$13:$D$42,\"PEI\",'9. Adjustment (MHSA)'!$E$13:$E$42,\"FY 2010-11\")","v":0},{"$f":"SUMIFS('9. Adjustment (MHSA)'!$F$13:$F$42,'9. Adjustment (MHSA)'!$D$13:$D$42,\"INN\",'9. Adjustment (MHSA)'!$E$13:$E$42,\"FY 2010-11\")","v":0},{"$f":"SUMIFS('9. Adjustment (MHSA)'!$F$13:$F$42,'9. Adjustment (MHSA)'!$D$13:$D$42,\"WET\",'9. Adjustment (MHSA)'!$E$13:$E$42,\"FY 2010-11\")","v":0},{"$f":"SUMIFS('9. Adjustment (MHSA)'!$F$13:$F$42,'9. Adjustment (MHSA)'!$D$13:$D$42,\"CFTN\",'9. Adjustment (MHSA)'!$E$13:$E$42,\"FY 2010-11\")","v":0},{"$f":"SUMIFS('9. Adjustment (MHSA)'!$F$13:$F$42,'9. Adjustment (MHSA)'!$D$13:$D$42,\"TTACB\",'9. Adjustment (MHSA)'!$E$13:$E$42,\"FY 2010-11\")","v":0},{"$f":"SUMIFS('9. Adjustment (MHSA)'!$F$13:$F$42,'9. Adjustment (MHSA)'!$D$13:$D$42,\"WET RP\",'9. Adjustment (MHSA)'!$E$13:$E$42,\"FY 2010-11\")","v":0},{"$f":"SUMIFS('9. Adjustment (MHSA)'!$F$13:$F$42,'9. Adjustment (MHSA)'!$D$13:$D$42,\"PEI SW\",'9. Adjustment (MHSA)'!$E$13:$E$42,\"FY 2010-11\")","v":0},null,null,0]
[null,7,"FY 2011-12",{"$f":"SUMIFS('9. Adjustment (MHSA)'!$F$13:$F$42,'9. Adjustment (MHSA)'!$D$13:$D$42,\"CSS\",'9. Adjustment (MHSA)'!$E$13:$E$42,\"FY 2011-12\")","v":0},{"$f":"SUMIFS('9. Adjustment (MHSA)'!$F$13:$F$42,'9. Adjustment (MHSA)'!$D$13:$D$42,\"PEI\",'9. Adjustment (MHSA)'!$E$13:$E$42,\"FY 2011-12\")","v":0},{"$f":"SUMIFS('9. Adjustment (MHSA)'!$F$13:$F$42,'9. Adjustment (MHSA)'!$D$13:$D$42,\"INN\",'9. Adjustment (MHSA)'!$E$13:$E$42,\"FY 2011-12\")","v":0},{"$f":"SUMIFS('9. Adjustment (MHSA)'!$F$13:$F$42,'9. Adjustment (MHSA)'!$D$13:$D$42,\"WET\",'9. Adjustment (MHSA)'!$E$13:$E$42,\"FY 2011-12\")","v":0},{"$f":"SUMIFS('9. Adjustment (MHSA)'!$F$13:$F$42,'9. Adjustment (MHSA)'!$D$13:$D$42,\"CFTN\",'9. Adjustment (MHSA)'!$E$13:$E$42,\"FY 2011-12\")","v":0},{"$f":"SUMIFS('9. Adjustment (MHSA)'!$F$13:$F$42,'9. Adjustment (MHSA)'!$D$13:$D$42,\"TTACB\",'9. Adjustment (MHSA)'!$E$13:$E$42,\"FY 2011-12\")","v":0},{"$f":"SUMIFS('9. Adjustment (MHSA)'!$F$13:$F$42,'9. Adjustment (MHSA)'!$D$13:$D$42,\"WET RP\",'9. Adjustment (MHSA)'!$E$13:$E$42,\"FY 2011-12\")","v":0},{"$f":"SUMIFS('9. Adjustment (MHSA)'!$F$13:$F$42,'9. Adjustment (MHSA)'!$D$13:$D$42,\"PEI SW\",'9. Adjustment (MHSA)'!$E$13:$E$42,\"FY 2011-12\")","v":0},null,null,0]
[null,8,"FY 2012-13",{"$f":"SUMIFS('9. Adjustment (MHSA)'!$F$13:$F$42,'9. Adjustment (MHSA)'!$D$13:$D$42,\"CSS\",'9. Adjustment (MHSA)'!$E$13:$E$42,\"FY 2012-13\")","v":0},{"$f":"SUMIFS('9. Adjustment (MHSA)'!$F$13:$F$42,'9. Adjustment (MHSA)'!$D$13:$D$42,\"PEI\",'9. Adjustment (MHSA)'!$E$13:$E$42,\"FY 2012-13\")","v":0},{"$f":"SUMIFS('9. Adjustment (MHSA)'!$F$13:$F$42,'9. Adjustment (MHSA)'!$D$13:$D$42,\"INN\",'9. Adjustment (MHSA)'!$E$13:$E$42,\"FY 2012-13\")","v":0},{"$f":"SUMIFS('9. Adjustment (MHSA)'!$F$13:$F$42,'9. Adjustment (MHSA)'!$D$13:$D$42,\"WET\",'9. Adjustment (MHSA)'!$E$13:$E$42,\"FY 2012-13\")","v":0},{"$f":"SUMIFS('9. Adjustment (MHSA)'!$F$13:$F$42,'9. Adjustment (MHSA)'!$D$13:$D$42,\"CFTN\",'9. Adjustment (MHSA)'!$E$13:$E$42,\"FY 2012-13\")","v":0},{"$f":"SUMIFS('9. Adjustment (MHSA)'!$F$13:$F$42,'9. Adjustment (MHSA)'!$D$13:$D$42,\"TTACB\",'9. Adjustment (MHSA)'!$E$13:$E$42,\"FY 2012-13\")","v":0},{"$f":"SUMIFS('9. Adjustment (MHSA)'!$F$13:$F$42,'9. Adjustment (MHSA)'!$D$13:$D$42,\"WET RP\",'9. Adjustment (MHSA)'!$E$13:$E$42,\"FY 2012-13\")","v":0},null,null,null,0]
[null,9,"FY 2013-14",{"$f":"SUMIFS('9. Adjustment (MHSA)'!$F$13:$F$42,'9. Adjustment (MHSA)'!$D$13:$D$42,\"CSS\",'9. Adjustment (MHSA)'!$E$13:$E$42,\"FY 2013-14\")","v":0},{"$f":"SUMIFS('9. Adjustment (MHSA)'!$F$13:$F$42,'9. Adjustment (MHSA)'!$D$13:$D$42,\"PEI\",'9. Adjustment (MHSA)'!$E$13:$E$42,\"FY 2013-14\")","v":0},{"$f":"SUMIFS('9. Adjustment (MHSA)'!$F$13:$F$42,'9. Adjustment (MHSA)'!$D$13:$D$42,\"INN\",'9. Adjustment (MHSA)'!$E$13:$E$42,\"FY 2013-14\")","v":0},{"$f":"SUMIFS('9. Adjustment (MHSA)'!$F$13:$F$42,'9. Adjustment (MHSA)'!$D$13:$D$42,\"WET\",'9. Adjustment (MHSA)'!$E$13:$E$42,\"FY 2013-14\")","v":0},{"$f":"SUMIFS('9. Adjustment (MHSA)'!$F$13:$F$42,'9. Adjustment (MHSA)'!$D$13:$D$42,\"CFTN\",'9. Adjustment (MHSA)'!$E$13:$E$42,\"FY 2013-14\")","v":0},{"$f":"SUMIFS('9. Adjustment (MHSA)'!$F$13:$F$42,'9. Adjustment (MHSA)'!$D$13:$D$42,\"TTACB\",'9. Adjustment (MHSA)'!$E$13:$E$42,\"FY 2013-14\")","v":0},{"$f":"SUMIFS('9. Adjustment (MHSA)'!$F$13:$F$42,'9. Adjustment (MHSA)'!$D$13:$D$42,\"WET RP\",'9. Adjustment (MHSA)'!$E$13:$E$42,\"FY 2013-14\")","v":0},null,null,null,0]
[null,10,"FY 2014-15",{"$f":"SUMIFS('9. Adjustment (MHSA)'!$F$13:$F$42,'9. Adjustment (MHSA)'!$D$13:$D$42,\"CSS\",'9. Adjustment (MHSA)'!$E$13:$E$42,\"FY 2014-15\")","v":0},{"$f":"SUMIFS('9. Adjustment (MHSA)'!$F$13:$F$42,'9. Adjustment (MHSA)'!$D$13:$D$42,\"PEI\",'9. Adjustment (MHSA)'!$E$13:$E$42,\"FY 2014-15\")","v":0},{"$f":"SUMIFS('9. Adjustment (MHSA)'!$F$13:$F$42,'9. Adjustment (MHSA)'!$D$13:$D$42,\"INN\",'9. Adjustment (MHSA)'!$E$13:$E$42,\"FY 2014-15\")","v":0},{"$f":"SUMIFS('9. Adjustment (MHSA)'!$F$13:$F$42,'9. Adjustment (MHSA)'!$D$13:$D$42,\"WET\",'9. Adjustment (MHSA)'!$E$13:$E$42,\"FY 2014-15\")","v":0},{"$f":"SUMIFS('9. Adjustment (MHSA)'!$F$13:$F$42,'9. Adjustment (MHSA)'!$D$13:$D$42,\"CFTN\",'9. Adjustment (MHSA)'!$E$13:$E$42,\"FY 2014-15\")","v":0},{"$f":"SUMIFS('9. Adjustment (MHSA)'!$F$13:$F$42,'9. Adjustment (MHSA)'!$D$13:$D$42,\"TTACB\",'9. Adjustment (MHSA)'!$E$13:$E$42,\"FY 2014-15\")","v":0},{"$f":"SUMIFS('9. Adjustment (MHSA)'!$F$13:$F$42,'9. Adjustment (MHSA)'!$D$13:$D$42,\"WET RP\",'9. Adjustment (MHSA)'!$E$13:$E$42,\"FY 2014-15\")","v":0},null,{"$f":"SUMIFS('9. Adjustment (MHSA)'!$F$13:$F$42,'9. Adjustment (MHSA)'!$D$13:$D$42,\"MHSA HP\",'9. Adjustment (MHSA)'!$E$13:$E$42,\"FY 2014-15\")","v":0},null,0]
[null,11,"FY 2015-16",{"$f":"SUMIFS('9. Adjustment (MHSA)'!$F$13:$F$42,'9. Adjustment (MHSA)'!$D$13:$D$42,\"CSS\",'9. Adjustment (MHSA)'!$E$13:$E$42,\"FY 2015-16\")","v":0},{"$f":"SUMIFS('9. Adjustment (MHSA)'!$F$13:$F$42,'9. Adjustment (MHSA)'!$D$13:$D$42,\"PEI\",'9. Adjustment (MHSA)'!$E$13:$E$42,\"FY 2015-16\")","v":0},{"$f":"SUMIFS('9. Adjustment (MHSA)'!$F$13:$F$42,'9. Adjustment (MHSA)'!$D$13:$D$42,\"INN\",'9. Adjustment (MHSA)'!$E$13:$E$42,\"FY 2015-16\")","v":0},{"$f":"SUMIFS('9. Adjustment (MHSA)'!$F$13:$F$42,'9. Adjustment (MHSA)'!$D$13:$D$42,\"WET\",'9. Adjustment (MHSA)'!$E$13:$E$42,\"FY 2015-16\")","v":0},{"$f":"SUMIFS('9. Adjustment (MHSA)'!$F$13:$F$42,'9. Adjustment (MHSA)'!$D$13:$D$42,\"CFTN\",'9. Adjustment (MHSA)'!$E$13:$E$42,\"FY 2015-16\")","v":0},{"$f":"SUMIFS('9. Adjustment (MHSA)'!$F$13:$F$42,'9. Adjustment (MHSA)'!$D$13:$D$42,\"TTACB\",'9. Adjustment (MHSA)'!$E$13:$E$42,\"FY 2015-16\")","v":0},{"$f":"SUMIFS('9. Adjustment (MHSA)'!$F$13:$F$42,'9. Adjustment (MHSA)'!$D$13:$D$42,\"WET RP\",'9. Adjustment (MHSA)'!$E$13:$E$42,\"FY 2015-16\")","v":0},null,{"$f":"SUMIFS('9. Adjustment (MHSA)'!$F$13:$F$42,'9. Adjustment (MHSA)'!$D$13:$D$42,\"MHSA HP\",'9. Adjustment (MHSA)'!$E$13:$E$42,\"FY 2015-16\")","v":0},null,0]
[null,12,"FY 2016-17",{"$f":"SUMIFS('9. Adjustment (MHSA)'!$F$13:$F$42,'9. Adjustment (MHSA)'!$D$13:$D$42,\"CSS\",'9. Adjustment (MHSA)'!$E$13:$E$42,\"FY 2016-17\")","v":0},{"$f":"SUMIFS('9. Adjustment (MHSA)'!$F$13:$F$42,'9. Adjustment (MHSA)'!$D$13:$D$42,\"PEI\",'9. Adjustment (MHSA)'!$E$13:$E$42,\"FY 2016-17\")","v":0},{"$f":"SUMIFS('9. Adjustment (MHSA)'!$F$13:$F$42,'9. Adjustment (MHSA)'!$D$13:$D$42,\"INN\",'9. Adjustment (MHSA)'!$E$13:$E$42,\"FY 2016-17\")","v":0},{"$f":"SUMIFS('9. Adjustment (MHSA)'!$F$13:$F$42,'9. Adjustment (MHSA)'!$D$13:$D$42,\"WET\",'9. Adjustment (MHSA)'!$E$13:$E$42,\"FY 2016-17\")","v":0},{"$f":"SUMIFS('9. Adjustment (MHSA)'!$F$13:$F$42,'9. Adjustment (MHSA)'!$D$13:$D$42,\"CFTN\",'9. Adjustment (MHSA)'!$E$13:$E$42,\"FY 2016-17\")","v":0},{"$f":"SUMIFS('9. Adjustment (MHSA)'!$F$13:$F$42,'9. Adjustment (MHSA)'!$D$13:$D$42,\"TTACB\",'9. Adjustment (MHSA)'!$E$13:$E$42,\"FY 2016-17\")","v":0},{"$f":"SUMIFS('9. Adjustment (MHSA)'!$F$13:$F$42,'9. Adjustment (MHSA)'!$D$13:$D$42,\"WET RP\",'9. Adjustment (MHSA)'!$E$13:$E$42,\"FY 2016-17\")","v":0},null,{"$f":"SUMIFS('9. Adjustment (MHSA)'!$F$13:$F$42,'9. Adjustment (MHSA)'!$D$13:$D$42,\"MHSA HP\",'9. Adjustment (MHSA)'!$E$13:$E$42,\"FY 2016-17\")","v":0},null,0]
[null,13,"Interest",{"$f":"SUMIFS('9. Adjustment (MHSA)'!$F$48:$F$77,'9. Adjustment (MHSA)'!$E$48:$E$77,\"CSS\")","v":0},{"$f":"SUMIFS('9. Adjustment (MHSA)'!$F$48:$F$77,'9. Adjustment (MHSA)'!$E$48:$E$77,\"PEI\")","v":0},{"$f":"SUMIFS('9. Adjustment (MHSA)'!$F$48:$F$77,'9. Adjustment (MHSA)'!$E$48:$E$77,\"INN\")","v":0},{"$f":"SUMIFS('9. Adjustment (MHSA)'!$F$48:$F$77,'9. Adjustment (MHSA)'!$E$48:$E$77,\"WET\")","v":0},{"$f":"SUMIFS('9. Adjustment (MHSA)'!$F$48:$F$77,'9. Adjustment (MHSA)'!$E$48:$E$77,\"CFTN\")","v":0},{"$f":"SUMIFS('9. Adjustment (MHSA)'!$F$48:$F$77,'9. Adjustment (MHSA)'!$E$48:$E$77,\"TTACB\")","v":0},{"$f":"SUMIFS('9. Adjustment (MHSA)'!$F$48:$F$77,'9. Adjustment (MHSA)'!$E$48:$E$77,\"WET RP\")","v":0},{"$f":"SUMIFS('9. Adjustment (MHSA)'!$F$48:$F$77,'9. Adjustment (MHSA)'!$E$48:$E$77,\"PEI SW\")","v":0},{"$f":"SUMIFS('9. Adjustment (MHSA)'!$F$48:$F$77,'9. Adjustment (MHSA)'!$E$48:$E$77,\"MHSA HP\")","v":0},{"$f":"SUMIFS('9. Adjustment (MHSA)'!$F$48:$F$77,'9. Adjustment (MHSA)'!$E$48:$E$77,\"Prudent Reserve\")","v":0},0]
[null,14,"TOTAL",{"$f":"SUM(D63:D75)","v":0},{"$f":"SUM(E63:E75)","v":0},0,0,0,0,0,0,0,0,0]
[null,"SECTION 6: Adjustments to FFP Revenue"]
[null,1,"FY 2006-07",{"$f":"'10. Adjustment (FFP)'!H13","v":0},{"$f":"'10. Adjustment (FFP)'!H23","v":0},{"$f":"'10. Adjustment (FFP)'!H33","v":0},{"$f":"'10. Adjustment (FFP)'!H43","v":0},null,null,null,null,null,null,{"$f":"SUM(D78:M78)","v":0}]
[null,2,"FY 2007-08",{"$f":"'10. Adjustment (FFP)'!H14","v":0},{"$f":"'10. Adjustment (FFP)'!H24","v":0},{"$f":"'10. Adjustment (FFP)'!H34","v":0},{"$f":"'10. Adjustment (FFP)'!H44","v":0},null,null,null,null,null,null,{"$f":"SUM(D79:M79)","v":0}]
[null,3,"FY 2008-09",{"$f":"'10. Adjustment (FFP)'!H15","v":0},{"$f":"'10. Adjustment (FFP)'!H25","v":0},{"$f":"'10. Adjustment (FFP)'!H35","v":0},{"$f":"'10. Adjustment (FFP)'!H45","v":0},null,null,null,null,null,null,0]
[null,4,"FY 2009-10",{"$f":"'10. Adjustment (FFP)'!H16","v":0},{"$f":"'10. Adjustment (FFP)'!H26","v":0},{"$f":"'10. Adjustment (FFP)'!H36","v":0},{"$f":"'10. Adjustment (FFP)'!H46","v":0},null,null,null,null,null,null,0]
[null,5,"FY 2010-11",{"$f":"'10. Adjustment (FFP)'!H17","v":0},{"$f":"'10. Adjustment (FFP)'!H27","v":0},{"$f":"'10. Adjustment (FFP)'!H37","v":0},{"$f":"'10. Adjustment (FFP)'!H47","v":0},null,null,null,null,null,null,0]
[null,6,"FY 2011-12",{"$f":"'10. Adjustment (FFP)'!H18","v":0},{"$f":"'10. Adjustment (FFP)'!H28","v":0},{"$f":"'10. Adjustment (FFP)'!H38","v":0},{"$f":"'10. Adjustment (FFP)'!H48","v":0},null,null,null,null,null,null,0]
[null,7,"FY 2012-13",{"$f":"'10. Adjustment (FFP)'!H19","v":0},{"$f":"'10. Adjustment (FFP)'!H29","v":0},{"$f":"'10. Adjustment (FFP)'!H39","v":0},{"$f":"'10. Adjustment (FFP)'!H49","v":0},null,null,null,null,null,null,0]
[null,8,"FY 2013-14",{"$f":"'10. Adjustment (FFP)'!H20","v":0},{"$f":"'10. Adjustment (FFP)'!H30","v":0},{"$f":"'10. Adjustment (FFP)'!H40","v":0},{"$f":"'10. Adjustment (FFP)'!H50","v":0},null,null,null,null,null,null,0]
[null,9,"FY 2014-15",{"$f":"'10. Adjustment (FFP)'!H21","v":0},{"$f":"'10. Adjustment (FFP)'!H31","v":0},{"$f":"'10. Adjustment (FFP)'!H41","v":0},{"$f":"'10. Adjustment (FFP)'!H51","v":0},null,null,null,null,null,null,0]
[null,10,"FY 2015-16",{"$f":"'10. Adjustment (FFP)'!H22","v":0},{"$f":"'10. Adjustment (FFP)'!H32","v":0},{"$f":"'10. Adjustment (FFP)'!H42","v":0},{"$f":"'10. Adjustment (FFP)'!H52","v":0},null,null,null,null,null,null,0]
[null,11,"TOTAL",{"$f":"SUM(D78:D87)","v":0},0,0,{"$f":"SUM(G78:G87)","v":0},null,null,null,null,null,null,0]
[null,"SECTION 7: Unspent MHSA Fund in the Local MHS Fund Balance (MHSA + FFP)"]
[null,1,"Local Prudent Reserve",null,null,null,null,null,null,null,null,null,{"$f":"M16+M30+M57+M58+M59+M63","v":793611},{"$f":"M90","v":793611}]
[null,2,"FY 2006-07",null,null,null,{"$f":"G17-G36+G64+G78","v":0},null,null,null,null,null,null,{"$f":"SUM(D91:M91)","v":0}]
[null,3,"FY 2007-08",null,null,null,0,{"$f":"H18-H37+H65+H79","v":359152},null,null,null,null,null,{"$f":"SUM(D92:M92)","v":359152}]
[null,4,"FY 2008-09",{"$f":"D19-D38+D66+D80","v":0},0,63500,0,180910,{"$f":"I19-I38+I66+I80","v":400},0,0,null,null,244810]
[null,5,"FY 2009-10",0,213500,63500,0,0,400,0,0,null,null,277400]
[null,6,"FY 2010-11",267794,135344,110900,0,0,400,0,25000,null,null,539438]
[null,7,"FY 2011-12",0,119585,45400,0,0,400,0,25000,null,null,190385]
[null,8,"FY 2012-13",54121,296249,74920,0,0,null,{"$f":"J23-J42+J70+J84","v":0},null,null,null,425290]
[null,9,"FY 2013-14",121715,230296,57574,0,0,null,{"$f":"J24-J43+J71+J85","v":0},null,null,null,409585]
[null,10,"FY 2014-15",{"$f":"D25-D44+D57+D72+D86","v":132755},{"$f":"E25-E44+E57+E72+E86","v":132408},{"$f":"F25-F44+F57+F72+F86","v":80590},{"$f":"G25-G44+G57+G72+G86","v":0},{"$f":"H25-H44+H57+H72+H86","v":0},null,{"$f":"J25-J44+J72+J86","v":0},null,null,null,345753]
[null,11,"FY 2015-16",{"$f":"D26-D45+D58+D73+D87","v":1103144},{"$f":"E26-E45+E58+E73+E87","v":294172},{"$f":"F26-F45+F58+F73+F87","v":73543},{"$f":"G26-G45+G58+G73+G87","v":-14308},{"$f":"H26-H45++H58+H73+H87","v":0},null,{"$f":"J26-J45+J73+J87","v":0},null,{"$f":"L26-L45+L73+L87","v":0},null,1456551]
[null,12,"FY 2016-17",{"$f":"D31-D46+D59+D74","v":1109542},{"$f":"E31-E46+E59+E74","v":295878},{"$f":"F31-F46+F59+F74","v":73969},{"$f":"G31-G46+G59+G74","v":-38155},{"$f":"H31-H46+H59+H74","v":0},null,{"$f":"J31-J46+J74","v":0},null,{"$f":"L31-L46+L59+L74","v":0},null,1441234]
[null,13,"Interest",{"$f":"(D27+D32)-(D47+D75)","v":36340},30851,17480,0,6367,53,0,8,0,{"$f":"M27+M32+M60+M75","v":27867},118966]
[null,14,"TOTAL",{"$f":"SUM(D90:D102)","v":2825411},{"$f":"SUM(E90:E102)","v":1748283},661376,{"$f":"SUM(G90:G102)","v":-52463},546429,1653,0,50008,0,821478,6602175]

{"sheet":"3. CSS","index":4,"n_rows":83,"n_cols":22,"rows_kept":83,"cut":false,"hidden":false,"merged":[[14,2,14,4],[15,2,15,4],[18,2,18,4],[24,2,24,4],[11,6,11,9],[16,2,16,4],[17,2,17,4],[0,1,0,3],[6,1,6,2],[13,2,13,4],[2,1,2,10],[3,1,3,10],[4,1,4,10],[11,10,11,20],[36,7,36,10],[36,11,36,21],[36,2,36,6],[19,2,19,4],[21,2,21,4],[20,2,20,4],[29,2,29,4],[30,2,30,4],[31,2,31,4],[22,2,22,4],[23,2,23,4]]}
[null,"Back to Summary"]
[]
[null,"Annual Mental Health Services Act Revenue and Expenditure Report          "]
[null,"Fiscal Year 2016-17"]
[null,"Community Services and Supports (CSS) Summary  "]
[]
[null,"County:",null,{"$f":"IF(ISBLANK('1. Information'!D6),\"\",'1. Information'!D6)","v":"Sierra"},null,"Date:",{"$f":"IF(ISBLANK('1. Information'!D5),\"\",'1. Information'!D5)","v":"2018-06-27"}]
[]
[null,"SECTION ONE"]
[]
[null,null,null,null,null,"A","B","C","D","E","F","G","H","I","J","K","L","M","N","O","P"]
[null,null,null,null,null,null,"Other Funds",null,null,null,"MHSA Funds"]
[null,null,null,null,null,"Total","Medi-Cal FFP","1991 Realignment","Behavioral Health Subaccount","Other Funding","Total MHSA CSS (Including MHSA Interest)","MHSA Interest","MHSA CSS 2016-17","MHSA CSS 2015-16","MHSA CSS 2014-15","MHSA CSS 2013-14","MHSA CSS 2012-13","MHSA CSS 2011-12","MHSA CSS 2010-11","MHSA CSS 2009-10","MHSA CSS 2008-09"]
[null,1,"CSS Annual Planning Costs",null,null,{"$f":"SUM($G14:$J14,$K14)","v":3978},null,null,null,null,{"$f":"SUM($M14:$U14, $L14)","v":3978},null,null,null,3978]
[null,2,"CSS Evaluation Costs",null,null,{"$f":"SUM($G15:$J15,$K15)","v":0},null,null,null,null,{"$f":"SUM($M15:$U15, $L15)","v":0},null,null,null,0]
[null,3,"CSS Administration Costs",null,null,160061,null,null,null,null,160061,10083,null,null,149978]
[null,4,"CSS Funds Transferred to JPA",null,null,{"$f":"SUM($G17:$J17,$K17)","v":0},null,null,null,null,0]
[null,5,"CSS Expenditure Incurred by JPA",null,null,{"$f":"SUM($G18:$J18,$K18)","v":0},null,null,null,null,{"$f":"SUM($M18:$U18, $L18)","v":0}]
[null,6,"CSS Funds Transferred to CalHFA",null,null,{"$f":"SUM($G19:$J19,$K19)","v":0},null,null,null,null,{"$f":"SUM($M19:$U19, $L19)","v":0}]
[null,7,"CSS Funds Transferred to WET",null,null,{"$f":"SUM($G20:$J20,$K20)","v":0},null,null,null,null,{"$f":"SUM($M20:$U20, $L20)","v":0}]
[null,8,"CSS Funds Transferred to CFTN",null,null,{"$f":"SUM($G21:$J21,$K21)","v":0},null,null,null,null,{"$f":"SUM($M21:$U21, $L21)","v":0}]
[null,9,"CSS Funds Transferred to PR",null,null,0,null,null,null,null,{"$f":"SUM($M22:$U22, $L22)","v":0}]
[null,10,"CSS Program Expenditures",null,null,{"$f":"SUM($G23:$J23,$K23)","v":725191},{"$f":"SUM($H39:$H83)","v":0},{"$f":"SUM($I39:$I83)","v":0},{"$f":"SUM($J39:$J83)","v":0},{"$f":"SUM(K39:K83)","v":0},725191,{"$f":"SUM($M39:$M83)","v":0},{"$f":"SUM(N39:N83)","v":0},{"$f":"SUM(O39:O83)","v":0},{"$f":"SUM(P39:P83)","v":725191},{"$f":"SUM(Q39:Q83)","v":0},0,0,0,0,0]
[null,11,"Total CSS Expenditures (Excluding Funds Transferred to JPA)",null,null,{"$f":"SUM(F14:F16,F18:F23)","v":889230},{"$f":"SUM(G14:G16,G18:G23)","v":0},0,0,0,889230,10083,0,0,879147,0,0,0,0,0,0]
[null,12,"Total MHSA CSS Available for Expenditures",null,null,null,null,null,null,null,{"$f":"SUM(L25,M25:U25)","v":3714641},{"$f":"'2. Component Summary'!D27+'2. Component Summary'!D32","v":46423},{"$f":"'2. Component Summary'!D30+'2. Component Summary'!D31","v":1109542},{"$f":"'2. Component Summary'!D26","v":1103144},{"$f":"'2. Component Summary'!D25","v":1011902},{"$f":"'2. Component Summary'!D24","v":121715},{"$f":"'2. Component Summary'!D23","v":54121},{"$f":"'2. Component Summary'!D22","v":0},{"$f":"'2. Component Summary'!D21","v":267794},{"$f":"'2. Component Summary'!D20","v":0},{"$f":"'2. Component Summary'!D19","v":0}]
[]
[null,"SECTION TWO"]
[]
[null,null,null,null,null,"A","B"]
[null,1,"Total MHSA FSP Program Expenditure",null,null,{"$f":"SUMIF($F$39:$F$83,\"FSP\",$L$39:$L$83)","v":224963},"(A)"]
[null,2,"Total MHSA CSS Expenditures (Excluding Funds Transferred)",null,null,{"$f":"SUM(K14:K16,K18,K23)","v":889230},"(B)"]
[null,3,"FSP Percentage of Total CSS Expenditure",null,null,{"$f":"IF($K$24=0,\"-\",(F30)/(F31))","v":0.25298629151063279},"(A) ÷ (B)"]
[]
[null,"SECTION THREE"]
[]
[null,null,"A","B","C","D","E","F","G","H","I","J","K","L","M","N","O","P","Q","R","S","T"]
[null,null,"CSS Component",null,null,null,null,"Other Funds",null,null,null,"MHSA Funds"]
[null,"#","County Code","Program Name","Prior Program Name","Service Category","Total CSS Program Expenditures","Medi-Cal FFP","1991 Realignment","Behavorial Health Subaccount","Other Funding","Total MHSA CSS (Including MHSA Interest)","MHSA Interest","MHSA CSS 2016-17","MHSA CSS 2015-16","MHSA CSS 2014-15","MHSA CSS 2013-14","MHSA CSS 2012-13","MHSA CSS 2011-12","MHSA CSS 2010-11","MHSA CSS 2009-10","MHSA CSS 2008-09"]
[null,1,{"$f":"IF(AND(NOT(COUNTA(D39:F39)),(NOT(COUNTA(H39:K39))),(NOT(COUNTA(N39:V39)))),\"\",VLOOKUP($D$7,Info_County_Code,2,FALSE))","v":46},"Wellness Center ",null,"Non-FSP",{"$f":"SUM(H39:K39,L39)","v":58941},null,null,null,null,{"$f":"SUM($N39:$V39)+$M39","v":58941},null,null,null,58941]
[null,2,46,"Ways to Wellness",null,"Non-FSP",{"$f":"SUM(H40:K40,L40)","v":601},null,null,null,null,601,null,null,null,601]
[null,3,46,"Seriously Mentally Ill",null,"Non-FSP",228827,null,null,null,null,228827,null,null,null,228827]
[null,4,46,"Outreach & Engagement",null,"Non-FSP",7354,null,null,null,null,7354,null,null,null,7354]
[null,5,46,"General Services & Delivery",null,"Non-FSP",204505,null,null,null,null,204505,null,null,null,204505]
[null,6,46,"FSP",null,"FSP",224963,null,null,null,null,224963,null,null,null,224963]
[null,7,"",null,null,null,0,null,null,null,null,0]
[null,8,"",null,null,null,0,null,null,null,null,0]
[null,9,"",null,null,null,0,null,null,null,null,0]
[null,10,"",null,null,null,0,null,null,null,null,0]
[null,11,"",null,null,null,0,null,null,null,null,0]
[null,12,"",null,null,null,0,null,null,null,null,0]
[null,13,"",null,null,null,0,null,null,null,null,0]
[null,14,"",null,null,null,0,null,null,null,null,0]
[null,15,"",null,null,null,0,null,null,null,null,0]
[null,16,"",null,null,null,0,null,null,null,null,0]
[null,17,"",null,null,null,0,null,null,null,null,0]
[null,18,"",null,null,null,0,null,null,null,null,0]
[null,19,"",null,null,null,0,null,null,null,null,0]
[null,20,"",null,null,null,0,null,null,null,null,0]
[null,21,"",null,null,null,0,null,null,null,null,0]
[null,22,"",null,null,null,0,null,null,null,null,0]
[null,23,"",null,null,null,0,null,null,null,null,0]
[null,24,"",null,null,null,0,null,null,null,null,0]
[null,25,"",null,null,null,0,null,null,null,null,0]
[null,26,"",null,null,null,0,null,null,null,null,0]
[null,27,"",null,null,null,0,null,null,null,null,0]
[null,28,"",null,null,null,0,null,null,null,null,0]
[null,29,"",null,null,null,0,null,null,null,null,0]
[null,30,"",null,null,null,0,null,null,null,null,0]
[null,31,"",null,null,null,0,null,null,null,null,0]
[null,32,"",null,null,null,0,null,null,null,null,0]
[null,33,"",null,null,null,0,null,null,null,null,0]
[null,34,"",null,null,null,0,null,null,null,null,0]
[null,35,"",null,null,null,0,null,null,null,null,0]
[null,36,"",null,null,null,0,null,null,null,null,0]
[null,37,"",null,null,null,0,null,null,null,null,0]
[null,38,"",null,null,null,0,null,null,null,null,0]
[null,39,"",null,null,null,0,null,null,null,null,0]
[null,40,"",null,null,null,0,null,null,null,null,0]
[null,41,"",null,null,null,0,null,null,null,null,0]
[null,42,"",null,null,null,0,null,null,null,null,0]
[null,43,"",null,null,null,0,null,null,null,null,0]
[null,44,"",null,null,null,0,null,null,null,null,0]
[null,45,"",null,null,null,0,null,null,null,null,0]

{"sheet":"4. PEI","index":5,"n_rows":66,"n_cols":27,"rows_kept":66,"cut":false,"hidden":false,"merged":[[26,6,28,6],[34,2,34,11],[26,5,28,5],[11,6,11,9],[11,10,11,20],[29,2,29,4],[6,1,6,2],[34,12,34,15],[34,16,34,26],[12,2,12,4],[13,2,13,4],[14,2,14,4],[15,2,15,4],[20,2,20,4],[21,2,21,4],[19,2,19,4],[17,2,17,4],[18,2,18,4],[16,2,16,4]]}
[null,"Back to Summary"]
[]
[null,"Annual Mental Health Services Act Revenue and Expenditure Report       "]
[null,"Fiscal Year 2016-17"]
[null,"Prevention and Early Intervention (PEI) Summary"]
[]
[null,"County:",null,{"$f":"IF(ISBLANK('1. Information'!D6),\"\",'1. Information'!D6)","v":"Sierra"},null,"Date:",{"$f":"IF(ISBLANK('1. Information'!D5),\"\",'1. Information'!D5)","v":"2018-06-27"}]
[]
[null,"SECTION ONE"]
[]
[null,null,null,null,null,"A","B","C","D","E","F","G","H","I","J","K","L","M","N","O","P"]
[null,null,null,null,null,null,"Other Funds",null,null,null,"MHSA Funds"]
[null,null,null,null,null,"Total","Medi-Cal FFP","1991 Realignment","Behavioral Health Subaccount","Other Funding","Total MHSA PEI (Including MHSA Interest)","MHSA Interest","MHSA PEI 2016-17","MHSA PEI 2015-16","MHSA PEI 2014-15","MHSA PEI 2013-14","MHSA PEI 2012-13","MHSA PEI 2011-12","MHSA PEI 2010-11","MHSA PEI 2009-10","MHSA PEI 2008-09"]
[null,1,"PEI Annual Planning Costs",null,null,{"$f":"SUM(G14:J14,K14)","v":0},null,null,null,null,{"$f":"SUM(L14,M14:U14)","v":0}]
[null,2,"PEI Evaluation Costs",null,null,{"$f":"SUM(G15:J15,K15)","v":0},null,null,null,null,{"$f":"SUM(L15,M15:U15)","v":0}]
[null,3,"PEI Administration Costs",null,null,{"$f":"SUM(G16:J16,K16)","v":30112},null,null,null,null,30112,7448,null,null,22664]
[null,4,"PEI Funds Expended by CalMHSA for PEI SW ",null,null,{"$f":"SUM(G17:J17,K17)","v":0},null,null,null,null,0]
[null,5,"PEI Funds Transferred to JPA",null,null,{"$f":"SUM(G18:J18,K18)","v":0},null,null,null,null,0]
[null,6,"PEI Expenditure Incurred by JPA",null,null,{"$f":"SUM(G19:J19,K19)","v":0},null,null,null,null,0]
[null,7,"PEI Program Expenditures",null,null,{"$f":"SUM(G20:J20,K20)","v":167290},{"$f":"SUMIF($G$37:$G$66,\"Combined Summary\",M$37:M$66) + SUMIF($F$37:$F$66,\"Standalone\",M$37:M$66)","v":0},0,0,0,167290,0,0,0,167290,0,0,0,0,0,0]
[null,8,"Total PEI Expenditures (Excluding Transfers and PEI SW)",null,null,{"$f":"SUM(F14:F16,F19:F20)","v":197402},{"$f":"SUM(G14:G16,G19:G20)","v":0},0,0,0,{"$f":"SUM(K14:K16,K19:K20)","v":197402},{"$f":"SUM(L14:L16,L19:L20)","v":7448},{"$f":"SUM(M14:M16,M19:M20)","v":0},{"$f":"SUM(N14:N16,N19:N20)","v":0},{"$f":"SUM(O14:O16,O19:O20)","v":189954},{"$f":"SUM(P14:P16,P19:P20)","v":0},{"$f":"SUM(Q14:Q16,Q19:Q20)","v":0},{"$f":"SUM(R14:R16,R19:R20)","v":0},{"$f":"SUM(S14:S16,S19:S20)","v":0},{"$f":"SUM(T14:T16,T19:T20)","v":0},{"$f":"SUM(U14:U16,U19:U20)","v":0}]
[null,9,"Total MHSA PEI Available for Expenditures",null,null,null,null,null,null,null,{"$f":"SUM(L22,M22:U22)","v":1945685},{"$f":"'2. Component Summary'!E27+'2. Component Summary'!E32","v":38299},{"$f":"'2. Component Summary'!E30+'2. Component Summary'!E31","v":295878},{"$f":"'2. Component Summary'!E26","v":294172},{"$f":"'2. Component Summary'!E25","v":322362},{"$f":"'2. Component Summary'!E24","v":230296},{"$f":"'2. Component Summary'!E23","v":296249},{"$f":"'2. Component Summary'!E22","v":119585},{"$f":"'2. Component Summary'!E21","v":135344},{"$f":"'2. Component Summary'!E20","v":213500},{"$f":"'2. Component Summary'!E19","v":0}]
[]
[null,"SECTION TWO"]
[]
[null,null,null,null,null,"A","B"]
[null,null,null,null,null,"Percent Expended for Clients 25 and Under, All PEI","Percent Expended for Clients 25 and Under, JPA"]
[]
[]
[null,1,"MHSA PEI Fund Expenditures in Program to Clients 25 and Under (calculated from weighted program values) divided by Total MHSA PEI Expenditures",null,null,{"$f":"IF(K21=0,\"\",((SUMPRODUCT($K$37:$K$66,$Q$37:$Q$66)+(K19*G30))/$K$21))","v":0}]
[]
[null,"SECTION THREE"]
[]
[null,null,"A","B","C","D","E","F","G","H","I","J","K","L","M","N","O","P","Q","R","S","T","U","V","W","X","Y"]
[null,null,"PEI Component",null,null,null,null,null,null,null,null,null,"Other Funds",null,null,null,"MHSA Funds"]
[null,"#","County","Program Name","Prior Program Name","Combined/ Standalone","Program Type","Program Activity Name (in Combined Program)","Subtotal Percentage for Combined Program","% of PEI Expended on Clients 25 & Under (Standalone and Program Activities in Combined Program)","% of PEI Expended on Clients 25 & Under (Combined Summary and Standalone)","Total PEI Program Expenditures","Medi-Cal FFP","1991 Realignment","Behavorial Health Subaccount","Other Funding","Total MHSA PEI (Including MHSA Interest)","MHSA Interest","MHSA PEI 2016-17","MHSA PEI 2015-16","MHSA PEI 2014-15","MHSA PEI 2013-14","MHSA PEI 2012-13","MHSA PEI 2011-12","MHSA PEI 2010-11","MHSA PEI 2009-10","MHSA PEI 2008-09"]
[null,1,{"$f":"IF(AND(NOT(COUNTA(D37:J37)),(NOT(COUNTA(M37:P37))),(NOT(COUNTA(R37:AA37)))),\"\",VLOOKUP($D$7,Info_County_Code,2,FALSE))","v":46},"Wellness Center",null,"Standalone","Prevention",null,null,null,{"$f":"IF(OR(G37=\"Combined Summary\",F37=\"Standalone\"),(SUMPRODUCT(--(D$37:D$66=D37),I$37:I$66,J$37:J$66)),\"\")","v":0},{"$f":"IF(AND(G37=\"Combined Summary\",F37=\"Combined\"),SUM(M37:Q37),IF(F37=\"Standalone\",SUM(M37:Q37),\"\"))","v":72909},null,null,null,null,{"$f":"SUM(R37,S37:AA37)","v":72909},null,null,null,72909]
[null,2,46,"Early Intervention",null,"Standalone","Early Intervention",null,null,null,0,{"$f":"IF(AND(G38=\"Combined Summary\",F38=\"Combined\"),SUM(M38:Q38),IF(F38=\"Standalone\",SUM(M38:Q38),\"\"))","v":14499},null,null,null,null,{"$f":"SUM(R38,S38:AA38)","v":14499},null,null,null,14499]
[null,3,46,"Music Together",null,"Standalone","Early Intervention",null,null,null,0,1328,null,null,null,null,1328,null,null,null,1328]
[null,4,46,"Student Parent Navigator",null,"Standalone","Access and Linkage",null,null,null,0,25306,null,null,null,null,25306,null,null,null,25306]
[null,5,46,"Nurturing Parenting",null,"Standalone","Early Intervention",null,null,null,0,13792,null,null,null,null,13792,null,null,null,13792]
[null,6,46,"MH First Aid",null,"Standalone","Prevention",null,null,null,0,4016,null,null,null,null,4016,null,null,null,4016]
[null,7,46,"Veteran's Peer Support",null,"Standalone","Prevention",null,null,null,0,35440,null,null,null,null,35440,null,null,null,35440]
[null,8,"",null,null,null,null,null,null,null,"","",null,null,null,null,0]
[null,9,"",null,null,null,null,null,null,null,"","",null,null,null,null,0]
[null,10,"",null,null,null,null,null,null,null,"","",null,null,null,null,0]
[null,11,"",null,null,null,null,null,null,null,"","",null,null,null,null,0]
[null,12,"",null,null,null,null,null,null,null,"","",null,null,null,null,0]
[null,13,"",null,null,null,null,null,null,null,"","",null,null,null,null,0]
[null,14,"",null,null,null,null,null,null,null,"","",null,null,null,null,0]
[null,15,"",null,null,null,null,null,null,null,"","",null,null,null,null,0]
[null,16,"",null,null,null,null,null,null,null,"","",null,null,null,null,0]
[null,17,"",null,null,null,null,null,null,null,"","",null,null,null,null,0]
[null,18,"",null,null,null,null,null,null,null,"","",null,null,null,null,0]
[null,19,"",null,null,null,null,null,null,null,"","",null,null,null,null,0]
[null,20,"",null,null,null,null,null,null,null,"","",null,null,null,null,0]
[null,21,"",null,null,null,null,null,null,null,"","",null,null,null,null,0]
[null,22,"",null,null,null,null,null,null,null,"","",null,null,null,null,0]
[null,23,"",null,null,null,null,null,null,null,"","",null,null,null,null,0]
[null,24,"",null,null,null,null,null,null,null,"","",null,null,null,null,0]
[null,25,"",null,null,null,null,null,null,null,"","",null,null,null,null,0]
[null,26,"",null,null,null,null,null,null,null,"","",null,null,null,null,0]
[null,27,"",null,null,null,null,null,null,null,"","",null,null,null,null,0]
[null,28,"",null,null,null,null,null,null,null,"","",null,null,null,null,0]
[null,29,"",null,null,null,null,null,null,null,"","",null,null,null,null,0]
[null,30,"",null,null,null,null,null,null,null,"","",null,null,null,null,0]

{"sheet":"5. INN","index":6,"n_rows":87,"n_cols":26,"rows_kept":87,"cut":false,"hidden":false,"merged":[[19,2,19,4],[20,2,20,4],[25,15,25,25],[25,2,25,9],[11,10,11,20],[11,6,11,9],[25,11,25,14],[0,1,0,3],[14,2,14,4],[16,2,16,4],[17,2,17,4],[18,2,18,4],[15,2,15,4],[6,1,6,2],[13,2,13,4],[12,2,12,4]]}
[null,"Back to Summary"]
[]
[null,"Annual Mental Health Services Act Revenue and Expenditure Report for"]
[null,"Fiscal Year 2016-17"]
[null,"Innovation (INN) Summary"]
[]
[null,"County:",null,{"$f":"IF(ISBLANK('1. Information'!D6),\"\",'1. Information'!D6)","v":"Sierra"},null,"Date:",{"$f":"IF(ISBLANK('1. Information'!D5),\"\",'1. Information'!D5)","v":"2018-06-27"}]
[]
[null,"SECTION ONE"]
[]
[null,null,null,null,null,"A","B","C","D","E","F","G","H","I","J","K","L","M","N","O","P"]
[null,null,null,null,null,null,"Other Funds",null,null,null,"MHSA INN Fiscal Year"]
[null,null,null,null,null,"Total","Medi-Cal FFP","1991 Realignment","Behavioral Health Subaccount","Other Funding","Total MHSA INN (Including MHSA Interest)","MHSA Interest","MHSA INN 2016-17","MHSA INN 2015-16","MHSA INN 2014-15","MHSA INN 2013-14","MHSA INN 2012-13","MHSA INN 2011-12","MHSA INN 2010-11","MHSA INN 2009-10","MHSA INN 2008-09"]
[null,1,"INN Annual Planning Costs",null,null,{"$f":"SUM(G14:J14,K14)","v":0},null,null,null,null,{"$f":"SUM(L14,M14:U14)","v":0}]
[null,2,"INN Indirect Administration",null,null,{"$f":"SUM(G15:J15,K15)","v":0},null,null,null,null,{"$f":"SUM(L15,M15:U15)","v":0}]
[null,3,"INN Project Administration",null,null,0,{"$f":"SUMIF($J$28:$J$87,\"Project Administration\",L$28:L$87)","v":0},{"$f":"SUMIF($J$28:$J$87,\"Project Administration\",M$28:M$87)","v":0},{"$f":"SUMIF($J$28:$J$87,\"Project Administration\",N$28:N$87)","v":0},{"$f":"SUMIF($J$28:$J$87,\"Project Administration\",O$28:O$87)","v":0},0,{"$f":"SUMIF($J$28:$J$87,\"Project Administration\",Q$28:Q$87)","v":0},0,0,0,0,0,0,0,0,0]
[null,4,"INN Project Evaluation",null,null,0,{"$f":"SUMIF($J$28:$J$87,\"Project Evaluation\",L$28:L$87)","v":0},{"$f":"SUMIF($J$28:$J$87,\"Project Evaluation\",M$28:M$87)","v":0},{"$f":"SUMIF($J$28:$J$87,\"Project Evaluation\",N$28:N$87)","v":0},{"$f":"SUMIF($J$28:$J$87,\"Project Evaluation\",O$28:O$87)","v":0},0,{"$f":"SUMIF($J$28:$J$87,\"Project Evaluation\",Q$28:Q$87)","v":0},0,0,0,0,0,0,0,0,{"$f":"SUMIF($J$28:$J$53,\"Project Evaluation\",Z$28:Z$53)","v":0}]
[null,5,"INN Project Direct",null,null,0,{"$f":"SUMIF($J$28:$J$87,\"Project Direct\",L$28:L$87)","v":0},{"$f":"SUMIF($J$28:$J$87,\"Project Direct\",M$28:M$87)","v":0},{"$f":"SUMIF($J$28:$J$87,\"Project Direct\",N$28:N$87)","v":0},{"$f":"SUMIF($J$28:$J$87,\"Project Direct\",O$28:O$87)","v":0},0,{"$f":"SUMIF($J$28:$J$87,\"Project Direct\",Q$28:Q$87)","v":0},0,0,0,0,0,0,0,0,{"$f":"SUMIF($J$28:$J$53,\"Project Direct\",Z$28:Z$53)","v":0}]
[null,6,"INN Project Subtotal",null,null,{"$f":"SUM(F16:F18)","v":0},{"$f":"SUM(G16:G18)","v":0},{"$f":"SUM(H16:H18)","v":0},{"$f":"SUM(I16:I18)","v":0},{"$f":"SUM(J16:J18)","v":0},{"$f":"SUM(L19,M19:U19)","v":0},{"$f":"SUM(L16:L18)","v":0},{"$f":"SUM(M16:M18)","v":0},{"$f":"SUM(N16:N18)","v":0},{"$f":"SUM(O16:O18)","v":0},{"$f":"SUM(P16:P18)","v":0},{"$f":"SUM(Q16:Q18)","v":0},{"$f":"SUM(R16:R18)","v":0},{"$f":"SUM(S16:S18)","v":0},{"$f":"SUM(T16:T18)","v":0},{"$f":"SUM(U16:U18)","v":0}]
[null,7,"Total Innovation Expenditures",null,null,{"$f":"SUM(F14:F15,F16:F18)","v":0},0,0,0,0,0,0,0,0,0,0,0,0,0,0,0]
[null,8,"Total MHSA INN Available for Expenditures",null,null,null,null,null,null,null,{"$f":"SUM(L21,M21:U21)","v":661376},{"$f":"'2. Component Summary'!F27+'2. Component Summary'!F32","v":17480},{"$f":"'2. Component Summary'!F30+'2. Component Summary'!F31","v":73969},{"$f":"'2. Component Summary'!F26","v":73543},{"$f":"'2. Component Summary'!F25","v":80590},{"$f":"'2. Component Summary'!F24","v":57574},{"$f":"'2. Component Summary'!F23","v":74920},{"$f":"'2. Component Summary'!F22","v":45400},{"$f":"'2. Component Summary'!F21","v":110900},{"$f":"'2. Component Summary'!F20","v":63500},{"$f":"'2. Component Summary'!F19","v":63500}]
[]
[null,"SECTION TWO"]
[]
[null,null,"A","B","C","D","E","F","G","H","I","J","K","L","M","N","O","P","Q","R","S","T","U","V","W","X"]
[null,null,"INN Component",null,null,null,null,null,null,null,null,"Other Funds",null,null,null,"MHSA Funds"]
[null,"#","County","Project Name","Prior Project Name","Project MHSOAC Approval Date","Project Start Date","MHSOAC-Authorized MHSA INN Project Budget","Amended MHSOAC-Authorized MHSA INN Project Budget","Project Expenditure Type","Total Project Expenditures by Type","Medi-Cal FFP","1991 Realignment","BH Subaccount","Other","Total MHSA INN Funds (Including MHSA Interest)","MHSA Interest","MHSA INN 2016-17","MHSA INN 2015-16","MHSA INN 2014-15","MHSA INN 2013-14","MHSA INN 2012-13","MHSA INN 2011-12","MHSA INN 2010-11","MHSA INN 2009-10","MHSA INN 2008-09"]
[null,1,{"$f":"IF(AND(NOT(COUNTA(D28:I28)),(NOT(COUNTA(L28:O28))),(NOT(COUNTA(R28:Z28)))),\"\",VLOOKUP($D$7,Info_County_Code,2,FALSE))","v":""},null,null,null,null,null,null,"Project Administration",{"$f":"SUM(L28:O28,P28)","v":0},null,null,null,null,{"$f":"SUM(Q28,R28:Z28)","v":0}]
[null,1,{"$f":"IF(ISBLANK(C28),\"\",C28)","v":""},"","","","","","","Project Evaluation",0,null,null,null,null,{"$f":"SUM(Q29,R29:Z29)","v":0}]
[null,1,{"$f":"IF(ISBLANK(C28),\"\",C28)","v":""},"","","","","","","Project Direct",0,null,null,null,null,0]
[null,1,{"$f":"IF(ISBLANK(C28),\"\",C28)","v":""},"","","","","","","Project Subtotal",0,{"$f":"SUM(L28:L30)","v":0},{"$f":"SUM(M28:M30)","v":0},0,0,0,0,{"$f":"SUM(R28:R30)","v":0},{"$f":"SUM(S28:S30)","v":0},{"$f":"SUM(T28:T30)","v":0},{"$f":"SUM(U28:U30)","v":0},{"$f":"SUM(V28:V30)","v":0},{"$f":"SUM(W28:W30)","v":0},{"$f":"SUM(X28:X30)","v":0},{"$f":"SUM(Y28:Y30)","v":0},{"$f":"SUM(Z28:Z30)","v":0}]
[null,2,{"$f":"IF(AND(NOT(COUNTA(D32:I32)),(NOT(COUNTA(L32:O32))),(NOT(COUNTA(R32:Z32)))),\"\",VLOOKUP($D$7,Info_County_Code,2,FALSE))","v":""},null,null,null,null,null,null,{"$f":"IF(NOT(ISBLANK(D32)),$J$28,\"\")","v":""},0,null,null,null,null,0]
[null,2,{"$f":"IF(ISBLANK(C32),\"\",C32)","v":""},"","","","","","",{"$f":"IF(NOT(ISBLANK(D32)),$J$29,\"\")","v":""},0,null,null,null,null,0]
[null,2,{"$f":"IF(ISBLANK(C32),\"\",C32)","v":""},"","","","","","",{"$f":"IF(NOT(ISBLANK(D32)),$J$30,\"\")","v":""},0,null,null,null,null,0]
[null,2,{"$f":"IF(ISBLANK(C32),\"\",C32)","v":""},"","","","","","",{"$f":"IF(NOT(ISBLANK(D32)),$J$31,\"\")","v":""},0,{"$f":"SUM(L32:L34)","v":0},{"$f":"SUM(M32:M34)","v":0},{"$f":"SUM(N32:N34)","v":0},{"$f":"SUM(O32:O34)","v":0},0,{"$f":"SUM(Q32:Q34)","v":0},{"$f":"SUM(R32:R34)","v":0},{"$f":"SUM(S32:S34)","v":0},{"$f":"SUM(T32:T34)","v":0},{"$f":"SUM(U32:U34)","v":0},{"$f":"SUM(V32:V34)","v":0},{"$f":"SUM(W32:W34)","v":0},{"$f":"SUM(X32:X34)","v":0},{"$f":"SUM(Y32:Y34)","v":0},{"$f":"SUM(Z32:Z34)","v":0}]
[null,3,{"$f":"IF(AND(NOT(COUNTA(D36:I36)),(NOT(COUNTA(L36:O36))),(NOT(COUNTA(R36:Z36)))),\"\",VLOOKUP($D$7,Info_County_Code,2,FALSE))","v":""},null,null,null,null,null,null,{"$f":"IF(NOT(ISBLANK(D36)),$J$28,\"\")","v":""},0,null,null,null,null,0]
[null,3,{"$f":"IF(ISBLANK(C36),\"\",C36)","v":""},"","","","","","",{"$f":"IF(NOT(ISBLANK(D36)),$J$29,\"\")","v":""},0,null,null,null,null,0]
[null,3,{"$f":"IF(ISBLANK(C36),\"\",C36)","v":""},"","","","","","",{"$f":"IF(NOT(ISBLANK(D36)),$J$30,\"\")","v":""},0,null,null,null,null,0]
[null,3,{"$f":"IF(ISBLANK(C36),\"\",C36)","v":""},"","","","","","",{"$f":"IF(NOT(ISBLANK(D36)),$J$31,\"\")","v":""},0,{"$f":"SUM(L36:L38)","v":0},{"$f":"SUM(M36:M38)","v":0},{"$f":"SUM(N36:N38)","v":0},{"$f":"SUM(O36:O38)","v":0},0,{"$f":"SUM(Q36:Q38)","v":0},{"$f":"SUM(R36:R38)","v":0},{"$f":"SUM(S36:S38)","v":0},{"$f":"SUM(T36:T38)","v":0},{"$f":"SUM(U36:U38)","v":0},{"$f":"SUM(V36:V38)","v":0},{"$f":"SUM(W36:W38)","v":0},{"$f":"SUM(X36:X38)","v":0},{"$f":"SUM(Y36:Y38)","v":0},{"$f":"SUM(Z36:Z38)","v":0}]
[null,4,{"$f":"IF(AND(NOT(COUNTA(D40:I40)),(NOT(COUNTA(L40:O40))),(NOT(COUNTA(R40:Z40)))),\"\",VLOOKUP($D$7,Info_County_Code,2,FALSE))","v":""},null,null,null,null,null,null,{"$f":"IF(NOT(ISBLANK(D40)),$J$28,\"\")","v":""},0,null,null,null,null,0]
[null,4,{"$f":"IF(ISBLANK(C40),\"\",C40)","v":""},"","","","","","",{"$f":"IF(NOT(ISBLANK(D40)),$J$29,\"\")","v":""},0,null,null,null,null,0]
[null,4,{"$f":"IF(ISBLANK(C40),\"\",C40)","v":""},"","","","","","",{"$f":"IF(NOT(ISBLANK(D40)),$J$30,\"\")","v":""},0,null,null,null,null,0]
[null,4,{"$f":"IF(ISBLANK(C40),\"\",C40)","v":""},"","","","","","",{"$f":"IF(NOT(ISBLANK(D40)),$J$31,\"\")","v":""},0,{"$f":"SUM(L40:L42)","v":0},{"$f":"SUM(M40:M42)","v":0},{"$f":"SUM(N40:N42)","v":0},{"$f":"SUM(O40:O42)","v":0},0,{"$f":"SUM(Q40:Q42)","v":0},{"$f":"SUM(R40:R42)","v":0},{"$f":"SUM(S40:S42)","v":0},{"$f":"SUM(T40:T42)","v":0},{"$f":"SUM(U40:U42)","v":0},{"$f":"SUM(V40:V42)","v":0},{"$f":"SUM(W40:W42)","v":0},{"$f":"SUM(X40:X42)","v":0},{"$f":"SUM(Y40:Y42)","v":0},{"$f":"SUM(Z40:Z42)","v":0}]
[null,5,{"$f":"IF(AND(NOT(COUNTA(D44:I44)),(NOT(COUNTA(L44:O44))),(NOT(COUNTA(R44:Z44)))),\"\",VLOOKUP($D$7,Info_County_Code,2,FALSE))","v":""},null,null,null,null,null,null,{"$f":"IF(NOT(ISBLANK(D44)),$J$28,\"\")","v":""},0,null,null,null,null,0]
[null,5,{"$f":"IF(ISBLANK(C44),\"\",C44)","v":""},"","","","","","",{"$f":"IF(NOT(ISBLANK(D44)),$J$29,\"\")","v":""},0,null,null,null,null,0]
[null,5,{"$f":"IF(ISBLANK(C44),\"\",C44)","v":""},"","","","","","",{"$f":"IF(NOT(ISBLANK(D44)),$J$30,\"\")","v":""},0,null,null,null,null,0]
[null,5,{"$f":"IF(ISBLANK(C44),\"\",C44)","v":""},"","","","","","",{"$f":"IF(NOT(ISBLANK(D44)),$J$31,\"\")","v":""},0,{"$f":"SUM(L44:L46)","v":0},{"$f":"SUM(M44:M46)","v":0},{"$f":"SUM(N44:N46)","v":0},{"$f":"SUM(O44:O46)","v":0},0,{"$f":"SUM(Q44:Q46)","v":0},{"$f":"SUM(R44:R46)","v":0},{"$f":"SUM(S44:S46)","v":0},{"$f":"SUM(T44:T46)","v":0},{"$f":"SUM(U44:U46)","v":0},{"$f":"SUM(V44:V46)","v":0},{"$f":"SUM(W44:W46)","v":0},{"$f":"SUM(X44:X46)","v":0},{"$f":"SUM(Y44:Y46)","v":0},{"$f":"SUM(Z44:Z46)","v":0}]
[null,6,{"$f":"IF(AND(NOT(COUNTA(D48:I48)),(NOT(COUNTA(L48:O48))),(NOT(COUNTA(R48:Z48)))),\"\",VLOOKUP($D$7,Info_County_Code,2,FALSE))","v":""},null,null,null,null,null,null,{"$f":"IF(NOT(ISBLANK(D48)),$J$28,\"\")","v":""},0,null,null,null,null,0]
[null,6,{"$f":"IF(ISBLANK(C48),\"\",C48)","v":""},"","","","","","",{"$f":"IF(NOT(ISBLANK(D48)),$J$29,\"\")","v":""},0,null,null,null,null,0]
[null,6,{"$f":"IF(ISBLANK(C48),\"\",C48)","v":""},"","","","","","",{"$f":"IF(NOT(ISBLANK(D48)),$J$30,\"\")","v":""},0,null,null,null,null,0]
[null,6,{"$f":"IF(ISBLANK(C48),\"\",C48)","v":""},"","","","","","",{"$f":"IF(NOT(ISBLANK(D48)),$J$31,\"\")","v":""},0,{"$f":"SUM(L48:L50)","v":0},{"$f":"SUM(M48:M50)","v":0},{"$f":"SUM(N48:N50)","v":0},{"$f":"SUM(O48:O50)","v":0},0,{"$f":"SUM(Q48:Q50)","v":0},{"$f":"SUM(R48:R50)","v":0},{"$f":"SUM(S48:S50)","v":0},{"$f":"SUM(T48:T50)","v":0},{"$f":"SUM(U48:U50)","v":0},{"$f":"SUM(V48:V50)","v":0},{"$f":"SUM(W48:W50)","v":0},{"$f":"SUM(X48:X50)","v":0},{"$f":"SUM(Y48:Y50)","v":0},{"$f":"SUM(Z48:Z50)","v":0}]
[null,7,{"$f":"IF(AND(NOT(COUNTA(D52:I52)),(NOT(COUNTA(L52:O52))),(NOT(COUNTA(R52:Z52)))),\"\",VLOOKUP($D$7,Info_County_Code,2,FALSE))","v":""},null,null,null,null,null,null,{"$f":"IF(NOT(ISBLANK(D52)),$J$28,\"\")","v":""},0,null,null,null,null,0]
[null,7,{"$f":"IF(ISBLANK(C52),\"\",C52)","v":""},"","","","","","",{"$f":"IF(NOT(ISBLANK(D52)),$J$29,\"\")","v":""},0,null,null,null,null,0]
[null,7,{"$f":"IF(ISBLANK(C52),\"\",C52)","v":""},"","","","","","",{"$f":"IF(NOT(ISBLANK(D52)),$J$30,\"\")","v":""},0,null,null,null,null,0]
[null,7,{"$f":"IF(ISBLANK(C52),\"\",C52)","v":""},"","","","","","",{"$f":"IF(NOT(ISBLANK(D52)),$J$31,\"\")","v":""},0,{"$f":"SUM(L52:L54)","v":0},{"$f":"SUM(M52:M54)","v":0},{"$f":"SUM(N52:N54)","v":0},{"$f":"SUM(O52:O54)","v":0},0,{"$f":"SUM(Q52:Q54)","v":0},{"$f":"SUM(R52:R54)","v":0},{"$f":"SUM(S52:S54)","v":0},{"$f":"SUM(T52:T54)","v":0},{"$f":"SUM(U52:U54)","v":0},{"$f":"SUM(V52:V54)","v":0},{"$f":"SUM(W52:W54)","v":0},{"$f":"SUM(X52:X54)","v":0},{"$f":"SUM(Y52:Y54)","v":0},{"$f":"SUM(Z52:Z54)","v":0}]
[null,8,{"$f":"IF(AND(NOT(COUNTA(D56:I56)),(NOT(COUNTA(L56:O56))),(NOT(COUNTA(R56:Z56)))),\"\",VLOOKUP($D$7,Info_County_Code,2,FALSE))","v":""},null,null,null,null,null,null,{"$f":"IF(NOT(ISBLANK(D56)),$J$28,\"\")","v":""},0,null,null,null,null,0]
[null,8,{"$f":"IF(ISBLANK(C56),\"\",C56)","v":""},"","","","","","",{"$f":"IF(NOT(ISBLANK(D56)),$J$29,\"\")","v":""},0,null,null,null,null,0]
[null,8,{"$f":"IF(ISBLANK(C56),\"\",C56)","v":""},"","","","","","",{"$f":"IF(NOT(ISBLANK(D56)),$J$30,\"\")","v":""},0,null,null,null,null,0]
[null,8,{"$f":"IF(ISBLANK(C56),\"\",C56)","v":""},"","","","","","",{"$f":"IF(NOT(ISBLANK(D56)),$J$31,\"\")","v":""},0,{"$f":"SUM(L56:L58)","v":0},{"$f":"SUM(M56:M58)","v":0},{"$f":"SUM(N56:N58)","v":0},{"$f":"SUM(O56:O58)","v":0},0,{"$f":"SUM(Q56:Q58)","v":0},{"$f":"SUM(R56:R58)","v":0},{"$f":"SUM(S56:S58)","v":0},{"$f":"SUM(T56:T58)","v":0},{"$f":"SUM(U56:U58)","v":0},{"$f":"SUM(V56:V58)","v":0},{"$f":"SUM(W56:W58)","v":0},{"$f":"SUM(X56:X58)","v":0},{"$f":"SUM(Y56:Y58)","v":0},{"$f":"SUM(Z56:Z58)","v":0}]
[null,9,{"$f":"IF(AND(NOT(COUNTA(D60:I60)),(NOT(COUNTA(L60:O60))),(NOT(COUNTA(R60:Z60)))),\"\",VLOOKUP($D$7,Info_County_Code,2,FALSE))","v":""},null,null,null,null,null,null,{"$f":"IF(NOT(ISBLANK(D60)),$J$28,\"\")","v":""},0,null,null,null,null,0]
[null,9,{"$f":"IF(ISBLANK(C60),\"\",C60)","v":""},"","","","","","",{"$f":"IF(NOT(ISBLANK(D60)),$J$29,\"\")","v":""},0,null,null,null,null,0]
[null,9,{"$f":"IF(ISBLANK(C60),\"\",C60)","v":""},"","","","","","",{"$f":"IF(NOT(ISBLANK(D60)),$J$30,\"\")","v":""},0,null,null,null,null,0]
[null,9,{"$f":"IF(ISBLANK(C60),\"\",C60)","v":""},"","","","","","",{"$f":"IF(NOT(ISBLANK(D60)),$J$31,\"\")","v":""},0,{"$f":"SUM(L60:L62)","v":0},{"$f":"SUM(M60:M62)","v":0},{"$f":"SUM(N60:N62)","v":0},{"$f":"SUM(O60:O62)","v":0},0,{"$f":"SUM(Q60:Q62)","v":0},{"$f":"SUM(R60:R62)","v":0},{"$f":"SUM(S60:S62)","v":0},{"$f":"SUM(T60:T62)","v":0},{"$f":"SUM(U60:U62)","v":0},{"$f":"SUM(V60:V62)","v":0},{"$f":"SUM(W60:W62)","v":0},{"$f":"SUM(X60:X62)","v":0},{"$f":"SUM(Y60:Y62)","v":0},{"$f":"SUM(Z60:Z62)","v":0}]
[null,10,{"$f":"IF(AND(NOT(COUNTA(D64:I64)),(NOT(COUNTA(L64:O64))),(NOT(COUNTA(R64:Z64)))),\"\",VLOOKUP($D$7,Info_County_Code,2,FALSE))","v":""},null,null,null,null,null,null,{"$f":"IF(NOT(ISBLANK(D64)),$J$28,\"\")","v":""},0,null,null,null,null,0]
[null,10,{"$f":"IF(ISBLANK(C64),\"\",C64)","v":""},"","","","","","",{"$f":"IF(NOT(ISBLANK(D64)),$J$29,\"\")","v":""},0,null,null,null,null,0]
[null,10,{"$f":"IF(ISBLANK(C64),\"\",C64)","v":""},"","","","","","",{"$f":"IF(NOT(ISBLANK(D64)),$J$30,\"\")","v":""},0,null,null,null,null,0]
[null,10,{"$f":"IF(ISBLANK(C64),\"\",C64)","v":""},"","","","","","",{"$f":"IF(NOT(ISBLANK(D64)),$J$31,\"\")","v":""},0,{"$f":"SUM(L64:L66)","v":0},{"$f":"SUM(M64:M66)","v":0},{"$f":"SUM(N64:N66)","v":0},{"$f":"SUM(O64:O66)","v":0},0,{"$f":"SUM(Q64:Q66)","v":0},{"$f":"SUM(R64:R66)","v":0},{"$f":"SUM(S64:S66)","v":0},{"$f":"SUM(T64:T66)","v":0},{"$f":"SUM(U64:U66)","v":0},{"$f":"SUM(V64:V66)","v":0},{"$f":"SUM(W64:W66)","v":0},{"$f":"SUM(X64:X66)","v":0},{"$f":"SUM(Y64:Y66)","v":0},{"$f":"SUM(Z64:Z66)","v":0}]
[null,11,{"$f":"IF(AND(NOT(COUNTA(D68:I68)),(NOT(COUNTA(L68:O68))),(NOT(COUNTA(R68:Z68)))),\"\",VLOOKUP($D$7,Info_County_Code,2,FALSE))","v":""},null,null,null,null,null,null,{"$f":"IF(NOT(ISBLANK(D68)),$J$28,\"\")","v":""},0,null,null,null,null,0]
[null,11,{"$f":"IF(ISBLANK(C68),\"\",C68)","v":""},"","","","","","",{"$f":"IF(NOT(ISBLANK(D68)),$J$29,\"\")","v":""},0,null,null,null,null,0]
[null,11,{"$f":"IF(ISBLANK(C68),\"\",C68)","v":""},"","","","","","",{"$f":"IF(NOT(ISBLANK(D68)),$J$30,\"\")","v":""},0,null,null,null,null,0]
[null,11,{"$f":"IF(ISBLANK(C68),\"\",C68)","v":""},"","","","","","",{"$f":"IF(NOT(ISBLANK(D68)),$J$31,\"\")","v":""},0,{"$f":"SUM(L68:L70)","v":0},{"$f":"SUM(M68:M70)","v":0},{"$f":"SUM(N68:N70)","v":0},{"$f":"SUM(O68:O70)","v":0},0,{"$f":"SUM(Q68:Q70)","v":0},{"$f":"SUM(R68:R70)","v":0},{"$f":"SUM(S68:S70)","v":0},{"$f":"SUM(T68:T70)","v":0},{"$f":"SUM(U68:U70)","v":0},{"$f":"SUM(V68:V70)","v":0},{"$f":"SUM(W68:W70)","v":0},{"$f":"SUM(X68:X70)","v":0},{"$f":"SUM(Y68:Y70)","v":0},{"$f":"SUM(Z68:Z70)","v":0}]
[null,12,{"$f":"IF(AND(NOT(COUNTA(D72:I72)),(NOT(COUNTA(L72:O72))),(NOT(COUNTA(R72:Z72)))),\"\",VLOOKUP($D$7,Info_County_Code,2,FALSE))","v":""},null,null,null,null,null,null,{"$f":"IF(NOT(ISBLANK(D72)),$J$28,\"\")","v":""},0,null,null,null,null,0]
[null,12,{"$f":"IF(ISBLANK(C72),\"\",C72)","v":""},"","","","","","",{"$f":"IF(NOT(ISBLANK(D72)),$J$29,\"\")","v":""},0,null,null,null,null,0]
[null,12,{"$f":"IF(ISBLANK(C72),\"\",C72)","v":""},"","","","","","",{"$f":"IF(NOT(ISBLANK(D72)),$J$30,\"\")","v":""},0,null,null,null,null,0]
[null,12,{"$f":"IF(ISBLANK(C72),\"\",C72)","v":""},"","","","","","",{"$f":"IF(NOT(ISBLANK(D72)),$J$31,\"\")","v":""},0,{"$f":"SUM(L72:L74)","v":0},{"$f":"SUM(M72:M74)","v":0},{"$f":"SUM(N72:N74)","v":0},{"$f":"SUM(O72:O74)","v":0},0,{"$f":"SUM(Q72:Q74)","v":0},{"$f":"SUM(R72:R74)","v":0},{"$f":"SUM(S72:S74)","v":0},{"$f":"SUM(T72:T74)","v":0},{"$f":"SUM(U72:U74)","v":0},{"$f":"SUM(V72:V74)","v":0},{"$f":"SUM(W72:W74)","v":0},{"$f":"SUM(X72:X74)","v":0},{"$f":"SUM(Y72:Y74)","v":0},{"$f":"SUM(Z72:Z74)","v":0}]
[null,13,{"$f":"IF(AND(NOT(COUNTA(D76:I76)),(NOT(COUNTA(L76:O76))),(NOT(COUNTA(R76:Z76)))),\"\",VLOOKUP($D$7,Info_County_Code,2,FALSE))","v":""},null,null,null,null,null,null,{"$f":"IF(NOT(ISBLANK(D76)),$J$28,\"\")","v":""},0,null,null,null,null,0]
[null,13,{"$f":"IF(ISBLANK(C76),\"\",C76)","v":""},"","","","","","",{"$f":"IF(NOT(ISBLANK(D76)),$J$29,\"\")","v":""},0,null,null,null,null,0]
[null,13,{"$f":"IF(ISBLANK(C76),\"\",C76)","v":""},"","","","","","",{"$f":"IF(NOT(ISBLANK(D76)),$J$30,\"\")","v":""},0,null,null,null,null,0]
[null,13,{"$f":"IF(ISBLANK(C76),\"\",C76)","v":""},"","","","","","",{"$f":"IF(NOT(ISBLANK(D76)),$J$31,\"\")","v":""},0,{"$f":"SUM(L76:L78)","v":0},{"$f":"SUM(M76:M78)","v":0},{"$f":"SUM(N76:N78)","v":0},{"$f":"SUM(O76:O78)","v":0},0,{"$f":"SUM(Q76:Q78)","v":0},{"$f":"SUM(R76:R78)","v":0},{"$f":"SUM(S76:S78)","v":0},{"$f":"SUM(T76:T78)","v":0},{"$f":"SUM(U76:U78)","v":0},{"$f":"SUM(V76:V78)","v":0},{"$f":"SUM(W76:W78)","v":0},{"$f":"SUM(X76:X78)","v":0},{"$f":"SUM(Y76:Y78)","v":0},{"$f":"SUM(Z76:Z78)","v":0}]
[null,14,{"$f":"IF(AND(NOT(COUNTA(D80:I80)),(NOT(COUNTA(L80:O80))),(NOT(COUNTA(R80:Z80)))),\"\",VLOOKUP($D$7,Info_County_Code,2,FALSE))","v":""},null,null,null,null,null,null,{"$f":"IF(NOT(ISBLANK(D80)),$J$28,\"\")","v":""},0,null,null,null,null,0]
[null,14,{"$f":"IF(ISBLANK(C80),\"\",C80)","v":""},"","","","","","",{"$f":"IF(NOT(ISBLANK(D80)),$J$29,\"\")","v":""},0,null,null,null,null,0]
[null,14,{"$f":"IF(ISBLANK(C80),\"\",C80)","v":""},"","","","","","",{"$f":"IF(NOT(ISBLANK(D80)),$J$30,\"\")","v":""},0,null,null,null,null,0]
[null,14,{"$f":"IF(ISBLANK(C80),\"\",C80)","v":""},"","","","","","",{"$f":"IF(NOT(ISBLANK(D80)),$J$31,\"\")","v":""},0,{"$f":"SUM(L80:L82)","v":0},{"$f":"SUM(M80:M82)","v":0},{"$f":"SUM(N80:N82)","v":0},{"$f":"SUM(O80:O82)","v":0},0,{"$f":"SUM(Q80:Q82)","v":0},{"$f":"SUM(R80:R82)","v":0},{"$f":"SUM(S80:S82)","v":0},{"$f":"SUM(T80:T82)","v":0},{"$f":"SUM(U80:U82)","v":0},{"$f":"SUM(V80:V82)","v":0},{"$f":"SUM(W80:W82)","v":0},{"$f":"SUM(X80:X82)","v":0},{"$f":"SUM(Y80:Y82)","v":0},{"$f":"SUM(Z80:Z82)","v":0}]
[null,15,{"$f":"IF(AND(NOT(COUNTA(D84:I84)),(NOT(COUNTA(L84:O84))),(NOT(COUNTA(R84:Z84)))),\"\",VLOOKUP($D$7,Info_County_Code,2,FALSE))","v":""},null,null,null,null,null,null,{"$f":"IF(NOT(ISBLANK(D84)),$J$28,\"\")","v":""},0,null,null,null,null,0]
[null,15,{"$f":"IF(ISBLANK(C84),\"\",C84)","v":""},"","","","","","",{"$f":"IF(NOT(ISBLANK(D84)),$J$29,\"\")","v":""},0,null,null,null,null,0]
[null,15,{"$f":"IF(ISBLANK(C84),\"\",C84)","v":""},"","","","","","",{"$f":"IF(NOT(ISBLANK(D84)),$J$30,\"\")","v":""},0,null,null,null,null,0]
[null,15,{"$f":"IF(ISBLANK(C84),\"\",C84)","v":""},"","","","","","",{"$f":"IF(NOT(ISBLANK(D84)),$J$31,\"\")","v":""},0,{"$f":"SUM(L84:L86)","v":0},{"$f":"SUM(M84:M86)","v":0},{"$f":"SUM(N84:N86)","v":0},{"$f":"SUM(O84:O86)","v":0},0,{"$f":"SUM(Q84:Q86)","v":0},{"$f":"SUM(R84:R86)","v":0},{"$f":"SUM(S84:S86)","v":0},{"$f":"SUM(T84:T86)","v":0},{"$f":"SUM(U84:U86)","v":0},{"$f":"SUM(V84:V86)","v":0},{"$f":"SUM(W84:W86)","v":0},{"$f":"SUM(X84:X86)","v":0},{"$f":"SUM(Y84:Y86)","v":0},{"$f":"SUM(Z84:Z86)","v":0}]

{"sheet":"6. WET","index":7,"n_rows":33,"n_cols":24,"rows_kept":33,"cut":false,"hidden":false,"merged":[[13,2,13,4],[26,11,26,23],[11,6,11,9],[11,10,11,22],[20,2,20,4],[16,2,16,4],[17,2,17,4],[14,2,14,4],[15,2,15,4],[19,2,19,4],[26,7,26,10],[26,2,26,6],[18,2,18,4]]}
[null,"Back to Summary"]
[]
[null,"Annual Mental Health Services Act Revenue and Expenditure Report             "]
[null,"Fiscal Year 2016-17"]
[null,"Workforce Education and Training (WET) Summary"]
[]
[null,null,"County:",{"$f":"IF(ISBLANK('1. Information'!D6),\"\",'1. Information'!D6)","v":"Sierra"},null,"Date:",{"$f":"IF(ISBLANK('1. Information'!D5),\"\",'1. Information'!D5)","v":"2018-06-27"}]
[]
[null,"SECTION ONE"]
[]
[null,null,null,null,null,"A","B","C","D","E","F","G","H","I","J","K","L","M","N","O","P","Q","R"]
[null,null,null,null,null,null,"Other Fund",null,null,null,"MHSA Fund"]
[null,null,null,null,null,"Total","Medi-Cal FFP","1991 Realignment","Behavioral Health Subaccount","Other Funding","Total MHSA WET (Including Interest)","MHSA Interest","MHSA WET 2016-17","MHSA WET 2015-16","MHSA WET 2014-15","MHSA WET 2013-14","MHSA WET 2012-13","MHSA WET 2011-12","MHSA WET 2010-11","MHSA WET 2009-10","MHSA WET 2008-09","MHSA WET 2007-08","MHSA WET 2006-07"]
[null,1,"WET Annual Planning Costs",null,null,{"$f":"SUM(G14:J14,K14)","v":0},null,null,null,null,{"$f":"SUM(L14,M14:W14)","v":0}]
[null,2,"WET Evaluation Costs",null,null,{"$f":"SUM(G15:J15,K15)","v":0},null,null,null,null,{"$f":"SUM(L15,M15:W15)","v":0}]
[null,3,"WET Administration Costs",null,null,{"$f":"SUM(G16:J16,K16)","v":5820},null,null,null,null,{"$f":"SUM(L16,M16:W16)","v":5820},null,5820]
[null,4,"WET Funds Transferred to JPA",null,null,{"$f":"SUM(G17:J17,K17)","v":0},null,null,null,null,{"$f":"SUM(L17,M17:W17)","v":0}]
[null,5,"WET Expenditure Incurred by JPA",null,null,0,null,null,null,null,0]
[null,6,"WET Program Expenditures",null,null,{"$f":"SUM(G19:J19,K19)","v":32335},{"$f":"SUM(H29:H33)","v":0},0,0,{"$f":"SUM(K29:K33)","v":0},{"$f":"SUM(L19,M19:W19)","v":32335},{"$f":"SUM(M29:M33)","v":0},32335,0,0,0,0,0,0,0,0,{"$f":"SUM(W29:W33)","v":0},{"$f":"SUM(X29:X33)","v":0}]
[null,7,"Total WET Expenditures (Excluding Transfers to JPA)",null,null,{"$f":"SUM(F14:F16,F18:F19)","v":38155},{"$f":"SUM(G14:G16,G18:G19)","v":0},{"$f":"SUM(H14:H16,H18:H19)","v":0},0,0,38155,0,38155,0,0,0,0,0,0,0,0,0,0]
[null,8,"Total MHSA WET Available for Expenditures",null,null,null,null,null,null,null,{"$f":"SUM(L21,M21:W21)","v":-14308},{"$f":"'2. Component Summary'!G27+'2. Component Summary'!G32","v":0},{"$f":"'2. Component Summary'!G30+'2. Component Summary'!G31","v":0},{"$f":"'2. Component Summary'!G26","v":-14308},{"$f":"'2. Component Summary'!G25","v":0},{"$f":"'2. Component Summary'!G24","v":0},{"$f":"'2. Component Summary'!G23","v":0},{"$f":"'2. Component Summary'!G22","v":0},{"$f":"'2. Component Summary'!G21","v":0},{"$f":"'2. Component Summary'!G20","v":0},{"$f":"'2. Component Summary'!G19","v":0},{"$f":"'2. Component Summary'!G18","v":0},{"$f":"'2. Component Summary'!G17","v":0}]
[]
[]
[null,"SECTION TWO"]
[]
[null,null,"A","B","C","D","E","F","G","H","I","J","K","L","M","N","O","P","Q","R","S","T","U","V"]
[null,null,"Wet Component",null,null,null,null,"Other Funds",null,null,null,"MHSA Funds"]
[null,"#","County","Program Name","Prior Program Name","Funding Category","Total WET Program Expenditures","Medi-Cal FFP","1991 Realignment","Behavorial Health Subaccount","Other Funding","Total MHSA WET (Including Interest)","MHSA Interest","MHSA WET 2016-17","MHSA WET 2015-16","MHSA WET 2014-15","MHSA WET 2013-14","MHSA WET 2012-13","MHSA WET 2011-12","MHSA WET 2010-11","MHSA WET 2009-10","MHSA WET 2008-09","MHSA WET 2007-08","MHSA WET 2006-07"]
[null,1,{"$f":"IF(AND(NOT(COUNTA(D29:E29)),(NOT(COUNTA(H29:K29))),(NOT(COUNTA(M29:X29)))),\"\",VLOOKUP($D$7,Info_County_Code,2,FALSE))","v":46},null,null,"Workforce Staffing",{"$f":"SUM(H29:K29,L29)","v":32335},null,null,null,null,{"$f":"SUM(M29,N29:X29)","v":32335},null,32335]
[null,2,{"$f":"IF(AND(NOT(COUNTA(D30:E30)),(NOT(COUNTA(H30:K30))),(NOT(COUNTA(M30:X30)))),\"\",VLOOKUP($D$7,Info_County_Code,2,FALSE))","v":""},null,null,"Training/Technical Assistance",{"$f":"SUM(H30:K30,L30)","v":0},null,null,null,null,{"$f":"SUM(M30,N30:X30)","v":0}]
[null,3,{"$f":"IF(AND(NOT(COUNTA(D31:E31)),(NOT(COUNTA(H31:K31))),(NOT(COUNTA(M31:X31)))),\"\",VLOOKUP($D$7,Info_County_Code,2,FALSE))","v":""},null,null,"MH Career Pathways",{"$f":"SUM(H31:K31,L31)","v":0},null,null,null,null,0]
[null,4,{"$f":"IF(AND(NOT(COUNTA(D32:E32)),(NOT(COUNTA(H32:K32))),(NOT(COUNTA(M32:X32)))),\"\",VLOOKUP($D$7,Info_County_Code,2,FALSE))","v":""},null,null,"Residency/Internship",{"$f":"SUM(H32:K32,L32)","v":0},null,null,null,null,0]
[null,5,{"$f":"IF(AND(NOT(COUNTA(D33:E33)),(NOT(COUNTA(H33:K33))),(NOT(COUNTA(M33:X33)))),\"\",VLOOKUP($D$7,Info_County_Code,2,FALSE))","v":""},null,null,"Financial Incentive",{"$f":"SUM(H33:K33,L33)","v":0},null,null,null,null,0]

{"sheet":"7. CFTN","index":8,"n_rows":48,"n_cols":24,"rows_kept":48,"cut":false,"hidden":false,"merged":[[11,6,11,9],[0,1,0,3],[11,10,11,22],[26,7,26,10],[26,11,26,23],[13,2,13,4],[15,2,15,4],[16,2,16,4],[17,2,17,4],[20,2,20,4],[19,2,19,4],[14,2,14,4],[26,2,26,6],[18,2,18,4],[21,2,21,4]]}
[null,"Back to Summary"]
[]
[null,"Annual Mental Health Services Act Revenue and Expenditure Report     "]
[null,"Fiscal Year 2016-17"]
[null,"Capital Facility Technological Needs (CFTN) Summary"]
[]
[null,"County:",null,{"$f":"IF(ISBLANK('1. Information'!D6),\"\",'1. Information'!D6)","v":"Sierra"},null,"Date:",{"$f":"IF(ISBLANK('1. Information'!D5),\"\",'1. Information'!D5)","v":"2018-06-27"}]
[]
[null,"SECTION ONE"]
[]
[null,null,null,null,null,"A","B","C","D","E","F","G","H","I","J","K","L","M","N","O","P","Q","R"]
[null,null,null,null,null,null,"Other Fund",null,null,null,"MHSA Funds"]
[null,null,null,null,null,"Total","Medi-Cal FFP","1991 Realignment","Behavioral Health Subaccount","Other Funding","Total MHSA CFTN","MHSA Interest","MHSA CFTN 2016-17","MHSA CFTN 2015-16","MHSA CFTN 2014-15","MHSA CFTN 2013-14","MHSA CFTN 2012-13","MHSA CFTN 2011-12","MHSA CFTN 2010-11","MHSA CFTN 2009-10","MHSA CFTN 2008-09","MHSA CFTN 2007-08","MHSA CFTN 2006-07"]
[null,1,"CF Annual Planning Costs",null,null,{"$f":"SUM(G14:J14,K14)","v":0},null,null,null,null,{"$f":"SUM(L14,M14:W14)","v":0}]
[null,2,"TN Annual Planning Costs",null,null,0,null,null,null,null,{"$f":"SUM(L15,M15:W15)","v":0}]
[null,3,"CF Evaluation Costs",null,null,0,null,null,null,null,0]
[null,4,"TN Evaluation Costs",null,null,0,null,null,null,null,0]
[null,5,"CF Administration",null,null,910,null,null,null,null,910,910]
[null,6,"TN Administration",null,null,0,null,null,null,null,0]
[null,7,"CFTN Program Expenditure",null,null,5055,{"$f":"SUM(H29:H48)","v":0},{"$f":"SUM(I29:I48)","v":0},{"$f":"SUM(J29:J48)","v":0},{"$f":"SUM(K29:K48)","v":0},5055,{"$f":"SUM(M29:M48)","v":5055},0,0,0,0,0,0,0,0,0,0,0]
[null,8,"Total CFTN Expenditures",null,null,{"$f":"SUM(F14:F20)","v":5965},{"$f":"SUM(G14:G20)","v":0},0,0,0,5965,5965,0,0,0,0,0,0,0,0,0,0,0]
[null,9,"Total MHSA CFTN Available for Expenditures",null,null,null,null,null,null,null,{"$f":"SUM(L22,M22:W22)","v":552394},{"$f":"'2. Component Summary'!H27+'2. Component Summary'!H32","v":12332},{"$f":"'2. Component Summary'!H30+'2. Component Summary'!H31","v":0},{"$f":"'2. Component Summary'!H26","v":0},{"$f":"'2. Component Summary'!H25","v":0},{"$f":"'2. Component Summary'!H24","v":0},{"$f":"'2. Component Summary'!H23","v":0},{"$f":"'2. Component Summary'!H22","v":0},{"$f":"'2. Component Summary'!H21","v":0},{"$f":"'2. Component Summary'!H20","v":0},{"$f":"'2. Component Summary'!H19","v":180910},{"$f":"'2. Component Summary'!H18","v":359152},{"$f":"'2. Component Summary'!H17","v":0}]
[]
[null,"SECTION TWO"]
[]
[null,null,"A","B","C","D","E","F","G","H","I","J","K","L","M","N","O","P","Q","R","S","T","U","V"]
[null,null,"CFTN Component",null,null,null,null,"Other Fund",null,null,null,"MHSA Fund"]
[null,"#","County","Project Name","Prior Project Name","Project Type","Total Project Expenditures","Medi-Cal FFP","1991 Realignment","Behavorial Health Subaccount","Other Funding","Total MHSA CFTN","MHSA Interest","MHSA CFTN 2016-17","MHSA CFTN 2015-16","MHSA CFTN 2014-15","MHSA CFTN 2013-14","MHSA CFTN 2012-13","MHSA CFTN 2011-12","MHSA CFTN 2010-11","MHSA CFTN 2009-10","MHSA CFTN 2008-09","MHSA CFTN 2007-08","MHSA CFTN 2006-07"]
[null,1,{"$f":"IF(AND(NOT(COUNTA(D29:F29)),(NOT(COUNTA(H29:K29))),(NOT(COUNTA(M29:X29)))),\"\",VLOOKUP($D$7,Info_County_Code,2,FALSE))","v":46},"Telepsych",null,null,{"$f":"SUM(H29:K29,L29)","v":5055},null,null,null,null,{"$f":"SUM(M29,N29:X29)","v":5055},5055]
[null,2,"",null,null,null,0,null,null,null,null,{"$f":"SUM(M30,N30:X30)","v":0}]
[null,3,"",null,null,null,0,null,null,null,null,0]
[null,4,"",null,null,null,0,null,null,null,null,0]
[null,5,"",null,null,null,0,null,null,null,null,0]
[null,6,"",null,null,null,0,null,null,null,null,0]
[null,7,"",null,null,null,0,null,null,null,null,0]
[null,8,"",null,null,null,0,null,null,null,null,0]
[null,9,"",null,null,null,0,null,null,null,null,0]
[null,10,"",null,null,null,0,null,null,null,null,0]
[null,11,"",null,null,null,0,null,null,null,null,0]
[null,12,"",null,null,null,0,null,null,null,null,0]
[null,13,"",null,null,null,0,null,null,null,null,0]
[null,14,"",null,null,null,0,null,null,null,null,0]
[null,15,"",null,null,null,0,null,null,null,null,0]
[null,16,"",null,null,null,0,null,null,null,null,0]
[null,17,"",null,null,null,0,null,null,null,null,0]
[null,18,"",null,null,null,0,null,null,null,null,0]
[null,19,"",null,null,null,0,null,null,null,null,0]
[null,20,"",null,null,null,0,null,null,null,null,0]

{"sheet":"8. TTACB, WET RP, HP","index":9,"n_rows":16,"n_cols":22,"rows_kept":16,"cut":false,"hidden":false,"merged":[[11,9,11,21],[0,1,0,3],[6,1,6,2],[11,2,11,4],[11,5,11,8]]}
[null,"Back to Summary"]
[]
[null,"Annual Mental Health Services Act Revenue and Expenditure Report"]
[null,"Fiscal Year 2016-17"]
[null,"TTACB, WET RP, MHSA HP Summary"]
[]
[null,"County:",null,{"$f":"IF(ISBLANK('1. Information'!D6),\"\",'1. Information'!D6)","v":"Sierra"},null,"Date:",{"$f":"IF(ISBLANK('1. Information'!D5),\"\",'1. Information'!D5)","v":"2018-06-27"}]
[]
[null,"SECTION ONE"]
[]
[null,null,"A","B","C","D","E","F","G","H","I","J","K","L","M","N","O","P","Q","R","S","T"]
[null,null,"TTACB, WET RP, PE SW, HP Component",null,null,"Other Funds",null,null,null,"MHSA Funds"]
[null,"#","County Code","Funding Type","Expenditures","Medi-Cal FFP","1991 Realignment","Behavorial Health Subaccount","Other Funding","Total MHSA TTACB, WET RP, HP","MHSA Interest"," TTACB, WET RP,  HP 2016-17"," TTACB, WET RP, HP 2015-16"," TTACB, WET RP, HP 2014-15"," TTACB, WET RP, HP 2013-14"," TTACB, WET RP, HP 2012-13"," TTACB, WET RP, HP 2011-12"," TTACB, WET RP, HP 2010-11"," TTACB, WET RP, HP 2009-10"," TTACB, WET RP, HP 2008-09"," TTACB, WET RP, HP 2007-08"," TTACB, WET RP, HP 2006-07"]
[null,1,{"$f":"IF(AND(NOT(COUNTA(F14:I14)),(NOT(COUNTA(L14:V14)))),\"\",VLOOKUP($D$7,Info_County_Code,2,FALSE))","v":""},"Training, Technical Assistance & Capacity Building (TTACB)",{"$f":"SUM(F14:I14,J14)","v":0},null,null,null,null,{"$f":"SUM(K14,L14:V14)","v":0}]
[null,2,{"$f":"IF(AND(NOT(COUNTA(F15:I15)),(NOT(COUNTA(L15:V15)))),\"\",VLOOKUP($D$7,Info_County_Code,2,FALSE))","v":""},"WET Regional Partnerships (WET RP)",{"$f":"SUM(F15:I15,J15)","v":0},null,null,null,null,{"$f":"SUM(K15,L15:V15)","v":0}]
[null,3,{"$f":"IF(AND(NOT(COUNTA(F16:I16)),(NOT(COUNTA(L16:V16)))),\"\",VLOOKUP($D$7,Info_County_Code,2,FALSE))","v":""},"MHSA Housing Program (Unencumbered Funds)",{"$f":"SUM(F16:I16,J16)","v":0},null,null,null,null,0]

{"sheet":"9. Adjustment (MHSA)","index":10,"n_rows":112,"n_cols":7,"rows_kept":112,"cut":false,"hidden":false,"merged":[[6,1,6,2]]}
[null,"Back to Summary"]
[]
[null,"Annual Mental Health Services Act Revenue and Expenditure Report"]
[null,"Fiscal Year 2016-17"]
[null,"Adjustments Worksheet (MHSA)"]
[]
[null,"County:",null,{"$f":"IF(ISBLANK('1. Information'!D6),\"\",'1. Information'!D6)","v":"Sierra"},null,"Date",{"$f":"IF(ISBLANK('1. Information'!D5),\"\",'1. Information'!D5)","v":"2018-06-27"}]
[]
[null,"SECTION ONE"]
[]
[null,null,"A","B","C","D","E"]
[null,"#","County","Component","Adjustment to FY","Amount","Reason"]
[null,1,{"$f":"IF(NOT(COUNTA(D13:G13)),\"\",VLOOKUP($D$7,Info_County_Code,2,FALSE))","v":""}]
[null,2,""]
[null,3,""]
[null,4,""]
[null,5,""]
[null,6,""]
[null,7,""]
[null,8,""]
[null,9,""]
[null,10,""]
[null,11,{"$f":"IF(NOT(COUNTA(D23:G23)),\"\",VLOOKUP($D$7,Info_County_Code,2,FALSE))","v":""}]
[null,12,""]
[null,13,""]
[null,14,""]
[null,15,""]
[null,16,""]
[null,17,""]
[null,18,""]
[null,19,""]
[null,20,""]
[null,21,""]
[null,22,""]
[null,23,""]
[null,24,""]
[null,25,""]
[null,26,""]
[null,27,""]
[null,28,""]
[null,29,""]
[null,30,""]
[null,null,{"$f":"IF(NOT(COUNTA(D43:G43)),\"\",VLOOKUP(D21,Info_County_Code,2,FALSE))","v":""}]
[null,"SECTION TWO"]
[]
[null,null,"A","B","C","D","E"]
[null,"#","County","Adjustment to","Component","Amount","Reason"]
[null,1,{"$f":"IF(NOT(COUNTA(E48:G48)),\"\",VLOOKUP($D$7,Info_County_Code,2,FALSE))","v":""},"Interest"]
[null,2,"","Interest"]
[null,3,"","Interest"]
[null,4,"","Interest"]
[null,5,"","Interest"]
[null,6,"","Interest"]
[null,7,"","Interest"]
[null,8,"","Interest"]
[null,9,"","Interest"]
[null,10,"","Interest"]
[null,11,"","Interest"]
[null,12,"","Interest"]
[null,13,"","Interest"]
[null,14,"","Interest"]
[null,15,"","Interest"]
[null,16,"","Interest"]
[null,17,"","Interest"]
[null,18,"","Interest"]
[null,19,"","Interest"]
[null,20,"","Interest"]
[null,21,"","Interest"]
[null,22,"","Interest"]
[null,23,"","Interest"]
[null,24,"","Interest"]
[null,25,"","Interest"]
[null,26,"","Interest"]
[null,27,"","Interest"]
[null,28,"","Interest"]
[null,29,"","Interest"]
[null,30,"","Interest"]
[]
[null,"SECTION THREE"]
[]
[null,null,"A","B","C","D"]
[null,"#","County","Adjustment to","Amount","Reason"]
[null,1,{"$f":"IF(NOT(COUNTA(E83:F83)),\"\",VLOOKUP($D$7,Info_County_Code,2,FALSE))","v":""},"Prudent Reserve"]
[null,2,"","Prudent Reserve"]
[null,3,"","Prudent Reserve"]
[null,4,"","Prudent Reserve"]
[null,5,"","Prudent Reserve"]
[null,6,"","Prudent Reserve"]
[null,7,"","Prudent Reserve"]
[null,8,"","Prudent Reserve"]
[null,9,"","Prudent Reserve"]
[null,10,"","Prudent Reserve"]
[null,11,"","Prudent Reserve"]
[null,12,"","Prudent Reserve"]
[null,13,"","Prudent Reserve"]
[null,14,"","Prudent Reserve"]
[null,15,"","Prudent Reserve"]
[null,16,"","Prudent Reserve"]
[null,17,"","Prudent Reserve"]
[null,18,"","Prudent Reserve"]
[null,19,"","Prudent Reserve"]
[null,20,"","Prudent Reserve"]
[null,21,"","Prudent Reserve"]
[null,22,"","Prudent Reserve"]
[null,23,"","Prudent Reserve"]
[null,24,"","Prudent Reserve"]
[null,25,"","Prudent Reserve"]
[null,26,"","Prudent Reserve"]
[null,27,"","Prudent Reserve"]
[null,28,"","Prudent Reserve"]
[null,29,"","Prudent Reserve"]
[null,30,"","Prudent Reserve"]

{"sheet":"10. Adjustment (FFP)","index":11,"n_rows":52,"n_cols":9,"rows_kept":52,"cut":false,"hidden":false,"merged":[[6,1,6,2],[0,1,0,3]]}
[null,"Back to Summary"]
[]
[null,"Annual Mental Health Services Act Revenue and Expenditure Report          "]
[null,"Fiscal Year 2016-17"]
[null,"FFP Revenue Adjustment"]
[]
[null,"County:",null,{"$f":"IF(ISBLANK('1. Information'!D6),\"\",'1. Information'!D6)","v":"Sierra"},null,"Date:",{"$f":"IF(ISBLANK('1. Information'!D5),\"\",'1. Information'!D5)","v":"2018-06-27"}]
[]
[null,"SECTION ONE"]
[]
[null,null,"A","B","C","D","E","F","G"]
[null,"#","County","Fiscal Year","Cost Report Stage","Component","Beginning Balance","Adjustment Amount","Ending Balance"]
[null,1,{"$f":"IF(NOT(COUNTA(G13:H13)),\"\",VLOOKUP($D$7,Info_County_Code,2,FALSE))","v":""},"FY 2006-07",null,"CSS",null,null,{"$f":"SUM(G13:H13)","v":0}]
[null,2,"","FY 2007-08",null,"CSS",null,null,{"$f":"SUM(G14:H14)","v":0}]
[null,3,"","FY 2008-09",null,"CSS",null,null,0]
[null,4,"","FY 2009-10",null,"CSS",null,null,0]
[null,5,"","FY 2010-11",null,"CSS",null,null,0]
[null,6,"","FY 2011-12",null,"CSS",null,null,0]
[null,7,"","FY 2012-13",null,"CSS",null,null,0]
[null,8,"","FY 2013-14",null,"CSS",null,null,0]
[null,9,"","FY 2014-15",null,"CSS",null,null,0]
[null,10,"","FY 2015-16",null,"CSS",null,null,0]
[null,11,"","FY 2006-07",null,"PEI",null,null,0]
[null,12,"","FY 2007-08",null,"PEI",null,null,0]
[null,13,"","FY 2008-09",null,"PEI",null,null,0]
[null,14,"","FY 2009-10",null,"PEI",null,null,0]
[null,15,"","FY 2010-11",null,"PEI",null,null,0]
[null,16,"","FY 2011-12",null,"PEI",null,null,0]
[null,17,"","FY 2012-13",null,"PEI",null,null,0]
[null,18,"","FY 2013-14",null,"PEI",null,null,0]
[null,19,"","FY 2014-15",null,"PEI",null,null,0]
[null,20,"","FY 2015-16",null,"PEI",null,null,0]
[null,21,"","FY 2006-07",null,"INN",null,null,0]
[null,22,"","FY 2007-08",null,"INN",null,null,0]
[null,23,"","FY 2008-09",null,"INN",null,null,0]
[null,24,"","FY 2009-10",null,"INN",null,null,0]
[null,25,"","FY 2010-11",null,"INN",null,null,0]
[null,26,"","FY 2011-12",null,"INN",null,null,0]
[null,27,"","FY 2012-13",null,"INN",null,null,0]
[null,28,"","FY 2013-14",null,"INN",null,null,0]
[null,29,"","FY 2014-15",null,"INN",null,null,0]
[null,30,"","FY 2015-16",null,"INN",null,null,0]
[null,31,"","FY 2006-07",null,"WET",null,null,0]
[null,32,"","FY 2007-08",null,"WET",null,null,0]
[null,33,"","FY 2008-09",null,"WET",null,null,0]
[null,34,"","FY 2009-10",null,"WET",null,null,0]
[null,35,"","FY 2010-11",null,"WET",null,null,0]
[null,36,"","FY 2011-12",null,"WET",null,null,0]
[null,37,"","FY 2012-13",null,"WET",null,null,0]
[null,38,"","FY 2013-14",null,"WET",null,null,0]
[null,39,"","FY 2014-15",null,"WET",null,null,0]
[null,40,"","FY 2015-16",null,"WET",null,null,0]

{"sheet":"11. Comments","index":12,"n_rows":47,"n_cols":3,"rows_kept":47,"cut":false,"hidden":false,"merged":[[0,0,0,2]]}
["Back to Summary"]
[]
[null,"Annual Mental Health Services Act Revenue and Expenditure Report          "]
[null,"Fiscal Year 2016-17"]
[null,"Comments"]
[]
[null,null,"Comments"]
[null,1]
[null,2]
[null,3]
[null,4]
[null,5]
[null,6]
[null,7]
[null,8]
[null,9]
[null,10]
[null,11]
[null,12]
[null,13]
[null,14]
[null,15]
[null,16]
[null,17]
[null,18]
[null,19]
[null,20]
[null,21]
[null,22]
[null,23]
[null,24]
[null,25]
[null,26]
[null,27]
[null,28]
[null,29]
[null,30]
[null,31]
[null,32]
[null,33]
[null,34]
[null,35]
[null,36]
[null,37]
[null,38]
[null,39]
[null,40]

{"sheet":"drop down fields","index":13,"n_rows":60,"n_cols":13,"rows_kept":60,"cut":false,"hidden":false,"merged":[[0,0,0,1]]}
["Info_County_Code",null,"Info_Population","CSS_Service_Category","PEI_Combined_Standalone","PEI_Program_Type","INN_Expenditure_Type","WET_Funding_Category","CFTN_Project_Type","Adjustment_MHSA_Component","Adjustment_FY","Adjustment_Reason","Cost_Report_Stage"]
["Alameda",1,"Yes","FSP","Combined","Prevention","Project","Workforce Staffing","Capital Facility","CSS","FY 2006-07","Cost Report Reconciliation","Audited"]
["Alpine",2,"No","Non-FSP","Standalone","Early Intervention","Project Administration","Training/Technical Assistance","Technological Need","PEI","FY 2007-08","Cost Report Audit","Settled"]
["Amador",3,null,null,null,"Outreach","Project Evaluation","MH Career Pathways",null,"INN","FY 2008-09","SDMC Chart Audit","Initial"]
["Berkeley City",65,null,null,null,"Stigma & Discrimination Reduction",null,"Residency/Internship",null,"WET","FY 2009-10","Local Quality Assurance Audit"]
["Butte",4,null,null,null,"Suicide Prevention",null,"Financial Incentive",null,"CFTN","FY 2010-11","Error"]
["Calaveras",5,null,null,null,"Access and Linkage",null,null,null,"TTACB","FY 2011-12","Other"]
["Colusa",6,null,null,null,"Improving Timely Access",null,null,null,"WET RP","FY 2012-13"]
["Contra Costa",7,null,null,null,"Combined Summary",null,null,null,"PEI SW","FY 2013-14"]
["Del Norte",8,null,null,null,null,null,null,null,"MHSA HP","FY 2014-15"]
["El Dorado",9,null,null,null,null,null,null,null,"Prudent Reserve","FY 2015-16"]
["Fresno",10,null,null,null,null,null,null,null,null,"FY 2016-17"]
["Glenn",11]
["Humboldt",12]
["Imperial",13]
["Inyo",14]
["Kern",15]
["Kings",16]
["Lake",17]
["Lassen",18]
["Los Angeles",19]
["Madera",20]
["Marin",21]
["Mariposa",22]
["Mendocino",23]
["Merced",24]
["Modoc",25]
["Mono",26]
["Monterey",27]
["Napa",28]
["Nevada",29]
["Orange",30]
["Placer",31]
["Plumas",32]
["Riverside",33]
["Sacramento",34]
["San Benito",35]
["San Bernardino",36]
["San Diego",37]
["San Francisco",38]
["San Joaquin",39]
["San Luis Obispo",40]
["San Mateo",41]
["Santa Barbara",42]
["Santa Clara",43]
["Santa Cruz",44]
["Shasta",45]
["Sierra",46]
["Siskiyou",47]
["Solano",48]
["Sonoma",49]
["Stanislaus",50]
["Sutter/Yuba",63]
["Tehama",52]
["Tri-City",66]
["Trinity",53]
["Tulare",54]
["Tuolumne",55]
["Ventura",56]
["Yolo",57]

{"sheet":"E-1 CountyState2017","index":14,"n_rows":82,"n_cols":5,"rows_kept":82,"cut":false,"hidden":false,"merged":[[4,1,4,2],[1,0,1,4],[2,0,2,4]]}
[null,null,null,"About the Data"]
["E-1: State/County Population Estimates with Annual Percent Change"]
["January 1, 2016 and 2017"]
[]
["State/County","           Total Population",null,"Percent"]
[null,"2016-01-01","2017-01-01","Change","County Population:  Over 200,000? (Yes or No)"]
[]
["California",39189035,39523613,0.9]
[]
["Alameda",1629233,1645359,1,{"$f":"IF(B10>=200000,\"Yes\", \"No\")","v":"Yes"}]
["Alpine",1160,1151,-0.8,{"$f":"IF(B11>=200000,\"Yes\", \"No\")","v":"No"}]
["Amador",37667,38382,1.9,"No"]
["Butte",224703,226404,0.8,"Yes"]
["Calaveras",45246,45168,-0.2,"No"]
["Colusa",21965,22043,0.4,"No"]
["Contra Costa",1126824,1139513,1.1000000000000001,"Yes"]
["Del Norte",27006,27124,0.4,"No"]
["El Dorado",184371,185062,0.4,"No"]
["Fresno",985079,995975,1.1000000000000001,"Yes"]
["Glenn",28639,28731,0.3,"No"]
["Humboldt",135557,136953,1,"No"]
["Imperial",186080,188334,1.2,"No"]
["Inyo",18632,18619,-0.1,"No"]
["Kern",886803,895112,0.9,"Yes"]
["Kings",149822,149537,-0.2,"No"]
["Lake",64790,64945,0.2,"No"]
["Lassen",30841,30918,0.2,"No"]
["Los Angeles",10182961,10241278,0.6,"Yes"]
["Madera",154933,156492,1,"No"]
["Marin",263150,263604,0.2,"Yes"]
["Mariposa",18167,18148,-0.1,"No"]
["Mendocino",88771,89134,0.4,"No"]
["Merced",271547,274665,1.1000000000000001,"Yes"]
["Modoc",9620,9580,-0.4,"No"]
["Mono",13654,13713,0.4,"No"]
["Monterey",438171,442365,1,"Yes"]
["Napa",141888,142408,0.4,"No"]
["Nevada",98609,98828,0.2,"No"]
["Orange",3172152,3194024,0.7,"Yes"]
["Placer",376203,382837,1.8,"Yes"]
["Plumas",19837,19819,-0.1,"No"]
["Riverside",2348213,2384783,1.6,"Yes"]
["Sacramento",1496619,1514770,1.2,"Yes"]
["San Benito",56621,56854,0.4,"No"]
["San Bernardino",2135724,2160256,1.1000000000000001,"Yes"]
["San Diego",3286717,3316192,0.9,"Yes"]
["San Francisco",864889,874228,1.1000000000000001,"Yes"]
["San Joaquin",735677,746868,1.5,"Yes"]
["San Luis Obispo",278480,280101,0.6,"Yes"]
["San Mateo",765895,770203,0.6,"Yes"]
["Santa Barbara",447295,450663,0.8,"Yes"]
["Santa Clara",1922619,1938180,0.8,"Yes"]
["Santa Cruz",275557,276603,0.4,"Yes"]
["Shasta",178232,178605,0.2,"No"]
["Sierra",3194,3207,0.4,"No"]
["Siskiyou",44722,44688,-0.1,"No"]
["Solano",430972,436023,1.2,"Yes"]
["Sonoma",502604,505120,0.5,"Yes"]
["Stanislaus",541466,548057,1.2,"Yes"]
["Sutter",96614,96956,0.4,"No"]
["Tehama",63942,63995,0.1,"No"]
["Trinity",13647,13628,-0.1,"No"]
["Tulare",466563,471842,1.1000000000000001,"Yes"]
["Tuolumne",54949,54707,-0.4,"No"]
["Ventura",853893,857386,0.4,"Yes"]
["Yolo",215522,218896,1.6,"Yes"]
["Yuba",74328,74577,0.3,"No"]
["Sutter/Yuba",{"$f":"B60+B67","v":170942},{"$f":"C60+C67","v":171533},null,"No"]
["Berkeley City",119997,121238,null,"No"]
["Tri-City",{"$f":"B72+B73+B74","v":387546},{"$f":"C72+C73+C74","v":391983},null,"Yes"]
[]
["Carlsbad",112866,113725]
["Oceanside",175842,176461]
["Vista",98838,101797]
[]
[]
["Department of Finance"]
["Demographic Research Unit"]
["Phone: (916) 323-4086"]
[]
["For more information:  http://www.dof.ca.gov/research/demographic/reports/estimates/e-1/view.php"]
["Released on May 1, 2017"]